2026-10-05 05:09:43,128 - INFO - Domain Default found not creating
2026-10-05 05:09:43,326 - INFO - Project ctest-TestBGPaasZone-38142884 not found, creating it
2026-10-05 05:09:43,947 - INFO - Created Project:ctest-TestBGPaasZone-38142884, ID : 41051239-dabc-4a3c-bc47-9964a7a0273a
2026-10-05 05:09:45,801 - DEBUG - Services list from nova: [, , , ]
2026-10-05 05:09:45,801 - DEBUG - Hosts: {'nova': ['an-jenkins-deploy-platform-ansible-os-6343-1', 'an-jenkins-deploy-platform-ansible-os-6343-2']}
2026-10-05 05:09:45,803 - INFO - ================================================================================
2026-10-05 05:09:45,803 - INFO - STARTING TEST : test_bgp_control_node_zone
2026-10-05 05:09:47,113 - DEBUG - Skipping xmpp flap check
2026-10-05 05:09:47,113 - INFO - Initial checks done. Running the testcase now
2026-10-05 05:09:47,113 - INFO -
2026-10-05 05:09:47,113 - INFO - executing bgp_control_zone test
2026-10-05 05:09:47,991 - DEBUG - Response for create_network : {'network': {'id': '6197eb9e-4c90-46dd-95c3-4b3e0b2cb669', 'name': 'ctest-cnz_vn-19205794', 'tenant_id': '41051239dabc4a3cbc479964a7a0273a', 'project_id': '41051239dabc4a3cbc479964a7a0273a', 'admin_state_up': True, 'shared': False, 'status': 'ACTIVE', 'router:external': False, 'mtu': 0, 'tags': [], 'subnets': [], 'fq_name': ['default-domain', 'ctest-TestBGPaasZone-38142884', 'ctest-cnz_vn-19205794'], 'port_security_enabled': True, 'description': ''}}
2026-10-05 05:09:48,280 - DEBUG - Response for create_subnet : {'subnet': {'id': 'bef2065a-9ffb-4123-ab5d-49c2e6238cb6', 'name': '', 'tenant_id': '41051239dabc4a3cbc479964a7a0273a', 'network_id': '6197eb9e-4c90-46dd-95c3-4b3e0b2cb669', 'ip_version': 4, 'cidr': '74.5.232.0/26', 'allocation_pools': [{'start': '74.5.232.2', 'end': '74.5.232.62'}], 'gateway_ip': '74.5.232.1', 'enable_dhcp': True, 'ipv6_ra_mode': None, 'ipv6_address_mode': None, 'dns_nameservers': [], 'host_routes': [], 'dns_server_address': '74.5.232.2', 'tags': [], 'project_id': '41051239dabc4a3cbc479964a7a0273a'}}
2026-10-05 05:09:48,304 - INFO - Created VN ctest-cnz_vn-19205794
2026-10-05 05:09:48,321 - DEBUG - VN ctest-cnz_vn-19205794 UUID is 6197eb9e-4c90-46dd-95c3-4b3e0b2cb669
2026-10-05 05:09:49,358 - INFO - VM ([]) created on node: (an-jenkins-deploy-platform-ansible-os-6343-1), Zone: (nova:an-jenkins-deploy-platform-ansible-os-6343-1)
2026-10-05 05:09:50,351 - INFO - VM ([]) created on node: (an-jenkins-deploy-platform-ansible-os-6343-2), Zone: (nova:an-jenkins-deploy-platform-ansible-os-6343-2)
2026-10-05 05:09:51,179 - INFO - VM ([]) created on node: (an-jenkins-deploy-platform-ansible-os-6343-1), Zone: (nova:an-jenkins-deploy-platform-ansible-os-6343-1)
2026-10-05 05:09:51,180 - INFO - Waiting for VM ctest-TestBGPaasZone-38142884-61930969 to be up..
2026-10-05 05:09:51,235 - DEBUG - VM is still in BUILD state, Expected: ACTIVE
2026-10-05 05:09:56,343 - DEBUG - VM is still in BUILD state, Expected: ACTIVE
2026-10-05 05:10:01,467 - DEBUG - VM is still in BUILD state, Expected: ACTIVE
2026-10-05 05:10:06,568 - DEBUG - VM is still in BUILD state, Expected: ACTIVE
2026-10-05 05:10:11,726 - DEBUG - VM is still in BUILD state, Expected: ACTIVE
2026-10-05 05:10:16,823 - DEBUG - VM is still in BUILD state, Expected: ACTIVE
2026-10-05 05:10:21,931 - DEBUG - VM is still in BUILD state, Expected: ACTIVE
2026-10-05 05:10:27,053 - DEBUG - VM is still in BUILD state, Expected: ACTIVE
2026-10-05 05:10:32,148 - DEBUG - VM is still in BUILD state, Expected: ACTIVE
2026-10-05 05:10:37,272 - DEBUG - VM is still in BUILD state, Expected: ACTIVE
2026-10-05 05:10:42,372 - DEBUG - VM is still in BUILD state, Expected: ACTIVE
2026-10-05 05:10:47,467 - DEBUG - VM is still in BUILD state, Expected: ACTIVE
2026-10-05 05:10:52,574 - DEBUG - VM is still in BUILD state, Expected: ACTIVE
2026-10-05 05:10:57,668 - DEBUG - VM is still in BUILD state, Expected: ACTIVE
2026-10-05 05:11:02,762 - DEBUG - VM is still in BUILD state, Expected: ACTIVE
2026-10-05 05:11:07,868 - DEBUG - VM is in ACTIVE state now
2026-10-05 05:11:07,868 - INFO - VM name : ctest-TestBGPaasZone-38142884-61930969
2026-10-05 05:11:07,963 - DEBUG - VM ctest-TestBGPaasZone-38142884-61930969 ID is dab7faed-b265-46ca-b863-d0f16eaf30e7
2026-10-05 05:11:07,999 - DEBUG - VM ctest-TestBGPaasZone-38142884-61930969 launched on Node an-jenkins-deploy-platform-ansible-os-6343-1
2026-10-05 05:11:08,109 - DEBUG - Requesting: http://10.0.0.190:8082/virtual-machine/dab7faed-b265-46ca-b863-d0f16eaf30e7
2026-10-05 05:11:08,485 - DEBUG - Requesting: http://10.0.0.190:8082/virtual-machine/dab7faed-b265-46ca-b863-d0f16eaf30e7
2026-10-05 05:11:08,524 - DEBUG - Requesting: http://10.0.0.190:8082/virtual-machine-interface/175ec1a5-ab56-45ee-a850-4676573fbc7d
2026-10-05 05:11:11,746 - DEBUG - (True, 'PING 169.254.0.7 (169.254.0.7) 56(84) bytes of data.\r\n\r\n--- 169.254.0.7 ping statistics ---\r\n2 packets transmitted, 0 received, 100% packet loss, time 1028ms')
2026-10-05 05:11:11,746 - DEBUG - Ping to Metadata IP 169.254.0.7 of VM ctest-TestBGPaasZone-38142884-61930969 failed!
2026-10-05 05:11:11,766 - DEBUG - Gateway for vn default-domain:ctest-TestBGPaasZone-38142884:ctest-cnz_vn-19205794 is 74.5.232.1 and allocation pool is NOT set
2026-10-05 05:11:15,871 - DEBUG - (True, 'PING 169.254.0.7 (169.254.0.7) 56(84) bytes of data.\r\n\r\n--- 169.254.0.7 ping statistics ---\r\n2 packets transmitted, 0 received, 100% packet loss, time 1037ms')
2026-10-05 05:11:15,871 - DEBUG - Ping to Metadata IP 169.254.0.7 of VM ctest-TestBGPaasZone-38142884-61930969 failed!
2026-10-05 05:11:15,888 - DEBUG - Gateway for vn default-domain:ctest-TestBGPaasZone-38142884:ctest-cnz_vn-19205794 is 74.5.232.1 and allocation pool is NOT set
2026-10-05 05:11:19,974 - DEBUG - (True, 'PING 169.254.0.7 (169.254.0.7) 56(84) bytes of data.\r\n\r\n--- 169.254.0.7 ping statistics ---\r\n2 packets transmitted, 0 received, 100% packet loss, time 1016ms')
2026-10-05 05:11:19,974 - DEBUG - Ping to Metadata IP 169.254.0.7 of VM ctest-TestBGPaasZone-38142884-61930969 failed!
2026-10-05 05:11:19,992 - DEBUG - Gateway for vn default-domain:ctest-TestBGPaasZone-38142884:ctest-cnz_vn-19205794 is 74.5.232.1 and allocation pool is NOT set
2026-10-05 05:11:24,067 - DEBUG - (True, 'PING 169.254.0.7 (169.254.0.7) 56(84) bytes of data.\r\n\r\n--- 169.254.0.7 ping statistics ---\r\n2 packets transmitted, 0 received, 100% packet loss, time 1010ms')
2026-10-05 05:11:24,067 - DEBUG - Ping to Metadata IP 169.254.0.7 of VM ctest-TestBGPaasZone-38142884-61930969 failed!
2026-10-05 05:11:24,087 - DEBUG - Gateway for vn default-domain:ctest-TestBGPaasZone-38142884:ctest-cnz_vn-19205794 is 74.5.232.1 and allocation pool is NOT set
2026-10-05 05:11:28,161 - DEBUG - (True, 'PING 169.254.0.7 (169.254.0.7) 56(84) bytes of data.\r\n\r\n--- 169.254.0.7 ping statistics ---\r\n2 packets transmitted, 0 received, 100% packet loss, time 1005ms')
2026-10-05 05:11:28,161 - DEBUG - Ping to Metadata IP 169.254.0.7 of VM ctest-TestBGPaasZone-38142884-61930969 failed!
2026-10-05 05:11:28,180 - DEBUG - Gateway for vn default-domain:ctest-TestBGPaasZone-38142884:ctest-cnz_vn-19205794 is 74.5.232.1 and allocation pool is NOT set
2026-10-05 05:11:32,257 - DEBUG - (True, 'PING 169.254.0.7 (169.254.0.7) 56(84) bytes of data.\r\n\r\n--- 169.254.0.7 ping statistics ---\r\n2 packets transmitted, 0 received, 100% packet loss, time 1012ms')
2026-10-05 05:11:32,257 - DEBUG - Ping to Metadata IP 169.254.0.7 of VM ctest-TestBGPaasZone-38142884-61930969 failed!
2026-10-05 05:11:32,275 - DEBUG - Gateway for vn default-domain:ctest-TestBGPaasZone-38142884:ctest-cnz_vn-19205794 is 74.5.232.1 and allocation pool is NOT set
2026-10-05 05:11:36,379 - DEBUG - (True, 'PING 169.254.0.7 (169.254.0.7) 56(84) bytes of data.\r\n\r\n--- 169.254.0.7 ping statistics ---\r\n2 packets transmitted, 0 received, 100% packet loss, time 1029ms')
2026-10-05 05:11:36,379 - DEBUG - Ping to Metadata IP 169.254.0.7 of VM ctest-TestBGPaasZone-38142884-61930969 failed!
2026-10-05 05:11:36,398 - DEBUG - Gateway for vn default-domain:ctest-TestBGPaasZone-38142884:ctest-cnz_vn-19205794 is 74.5.232.1 and allocation pool is NOT set
2026-10-05 05:11:40,481 - DEBUG - (True, 'PING 169.254.0.7 (169.254.0.7) 56(84) bytes of data.\r\n\r\n--- 169.254.0.7 ping statistics ---\r\n2 packets transmitted, 0 received, 100% packet loss, time 1014ms')
2026-10-05 05:11:40,481 - DEBUG - Ping to Metadata IP 169.254.0.7 of VM ctest-TestBGPaasZone-38142884-61930969 failed!
2026-10-05 05:11:40,500 - DEBUG - Gateway for vn default-domain:ctest-TestBGPaasZone-38142884:ctest-cnz_vn-19205794 is 74.5.232.1 and allocation pool is NOT set
2026-10-05 05:11:44,579 - DEBUG - (True, 'PING 169.254.0.7 (169.254.0.7) 56(84) bytes of data.\r\n\r\n--- 169.254.0.7 ping statistics ---\r\n2 packets transmitted, 0 received, 100% packet loss, time 1004ms')
2026-10-05 05:11:44,580 - DEBUG - Ping to Metadata IP 169.254.0.7 of VM ctest-TestBGPaasZone-38142884-61930969 failed!
2026-10-05 05:11:44,597 - DEBUG - Gateway for vn default-domain:ctest-TestBGPaasZone-38142884:ctest-cnz_vn-19205794 is 74.5.232.1 and allocation pool is NOT set
2026-10-05 05:11:48,671 - DEBUG - (True, 'PING 169.254.0.7 (169.254.0.7) 56(84) bytes of data.\r\n\r\n--- 169.254.0.7 ping statistics ---\r\n2 packets transmitted, 0 received, 100% packet loss, time 1013ms')
2026-10-05 05:11:48,672 - DEBUG - Ping to Metadata IP 169.254.0.7 of VM ctest-TestBGPaasZone-38142884-61930969 failed!
2026-10-05 05:11:48,691 - DEBUG - Gateway for vn default-domain:ctest-TestBGPaasZone-38142884:ctest-cnz_vn-19205794 is 74.5.232.1 and allocation pool is NOT set
2026-10-05 05:11:52,773 - DEBUG - (True, 'PING 169.254.0.7 (169.254.0.7) 56(84) bytes of data.\r\n\r\n--- 169.254.0.7 ping statistics ---\r\n2 packets transmitted, 0 received, 100% packet loss, time 1006ms')
2026-10-05 05:11:52,773 - DEBUG - Ping to Metadata IP 169.254.0.7 of VM ctest-TestBGPaasZone-38142884-61930969 failed!
2026-10-05 05:11:52,804 - DEBUG - Gateway for vn default-domain:ctest-TestBGPaasZone-38142884:ctest-cnz_vn-19205794 is 74.5.232.1 and allocation pool is NOT set
2026-10-05 05:11:56,897 - DEBUG - (True, 'PING 169.254.0.7 (169.254.0.7) 56(84) bytes of data.\r\n\r\n--- 169.254.0.7 ping statistics ---\r\n2 packets transmitted, 0 received, 100% packet loss, time 1029ms')
2026-10-05 05:11:56,897 - DEBUG - Ping to Metadata IP 169.254.0.7 of VM ctest-TestBGPaasZone-38142884-61930969 failed!
2026-10-05 05:11:56,920 - DEBUG - Gateway for vn default-domain:ctest-TestBGPaasZone-38142884:ctest-cnz_vn-19205794 is 74.5.232.1 and allocation pool is NOT set
2026-10-05 05:12:01,027 - DEBUG - (True, 'PING 169.254.0.7 (169.254.0.7) 56(84) bytes of data.\r\n\r\n--- 169.254.0.7 ping statistics ---\r\n2 packets transmitted, 0 received, 100% packet loss, time 1040ms')
2026-10-05 05:12:01,027 - DEBUG - Ping to Metadata IP 169.254.0.7 of VM ctest-TestBGPaasZone-38142884-61930969 failed!
2026-10-05 05:12:01,045 - DEBUG - Gateway for vn default-domain:ctest-TestBGPaasZone-38142884:ctest-cnz_vn-19205794 is 74.5.232.1 and allocation pool is NOT set
2026-10-05 05:12:05,124 - DEBUG - (True, 'PING 169.254.0.7 (169.254.0.7) 56(84) bytes of data.\r\n\r\n--- 169.254.0.7 ping statistics ---\r\n2 packets transmitted, 0 received, 100% packet loss, time 1005ms')
2026-10-05 05:12:05,124 - DEBUG - Ping to Metadata IP 169.254.0.7 of VM ctest-TestBGPaasZone-38142884-61930969 failed!
2026-10-05 05:12:05,142 - DEBUG - Gateway for vn default-domain:ctest-TestBGPaasZone-38142884:ctest-cnz_vn-19205794 is 74.5.232.1 and allocation pool is NOT set
2026-10-05 05:12:09,224 - DEBUG - (True, 'PING 169.254.0.7 (169.254.0.7) 56(84) bytes of data.\r\n\r\n--- 169.254.0.7 ping statistics ---\r\n2 packets transmitted, 0 received, 100% packet loss, time 1008ms')
2026-10-05 05:12:09,224 - DEBUG - Ping to Metadata IP 169.254.0.7 of VM ctest-TestBGPaasZone-38142884-61930969 failed!
2026-10-05 05:12:09,242 - DEBUG - Gateway for vn default-domain:ctest-TestBGPaasZone-38142884:ctest-cnz_vn-19205794 is 74.5.232.1 and allocation pool is NOT set
2026-10-05 05:12:13,314 - DEBUG - (True, 'PING 169.254.0.7 (169.254.0.7) 56(84) bytes of data.\r\n\r\n--- 169.254.0.7 ping statistics ---\r\n2 packets transmitted, 0 received, 100% packet loss, time 1002ms')
2026-10-05 05:12:13,314 - DEBUG - Ping to Metadata IP 169.254.0.7 of VM ctest-TestBGPaasZone-38142884-61930969 failed!
2026-10-05 05:12:13,332 - DEBUG - Gateway for vn default-domain:ctest-TestBGPaasZone-38142884:ctest-cnz_vn-19205794 is 74.5.232.1 and allocation pool is NOT set
2026-10-05 05:12:15,411 - DEBUG - (True, 'PING 169.254.0.7 (169.254.0.7) 56(84) bytes of data.\r\n64 bytes from 169.254.0.7: icmp_seq=1 ttl=63 time=17.0 ms\r\n64 bytes from 169.254.0.7: icmp_seq=2 ttl=63 time=4.19 ms\r\n\r\n--- 169.254.0.7 ping statistics ---\r\n2 packets transmitted, 2 received, 0% packet loss, time 1001ms\r\nrtt min/avg/max/mdev = 4.189/10.618/17.047/6.429 ms')
2026-10-05 05:12:15,411 - INFO - Ping to Metadata IP 169.254.0.7 of VM ctest-TestBGPaasZone-38142884-61930969 passed
2026-10-05 05:12:15,490 - DEBUG - verify_vm_launched is skipped since self.vm_launch_flag is set
2026-10-05 05:12:15,490 - DEBUG - Waiting to SSH to VM ctest-TestBGPaasZone-38142884-61930969, IP 74.5.232.3, Port 22
2026-10-05 05:12:15,560 - DEBUG - Error on ssh to ubuntu@169.254.0.7:22, result: /bin/bash: connect: Connection refused
/bin/bash: line 1: /dev/tcp/169.254.0.7/22: Connection refused {'failed': True, 'command': '(echo > /dev/tcp/169.254.0.7/22)', 'real_command': '/bin/bash -l -c "(echo > /dev/tcp/169.254.0.7/22)"', 'return_code': 1, 'succeeded': False, 'stderr': ''}
2026-10-05 05:12:15,690 - DEBUG - VM ctest-TestBGPaasZone-38142884-61930969 is NOT ready for SSH connections, VM status: ACTIVE
2026-10-05 05:12:20,691 - DEBUG - verify_vm_launched is skipped since self.vm_launch_flag is set
2026-10-05 05:12:20,691 - DEBUG - Waiting to SSH to VM ctest-TestBGPaasZone-38142884-61930969, IP 74.5.232.3, Port 22
2026-10-05 05:12:20,760 - DEBUG - Error on ssh to ubuntu@169.254.0.7:22, result: /bin/bash: connect: Connection refused
/bin/bash: line 1: /dev/tcp/169.254.0.7/22: Connection refused {'failed': True, 'command': '(echo > /dev/tcp/169.254.0.7/22)', 'real_command': '/bin/bash -l -c "(echo > /dev/tcp/169.254.0.7/22)"', 'return_code': 1, 'succeeded': False, 'stderr': ''}
2026-10-05 05:12:20,863 - DEBUG - VM ctest-TestBGPaasZone-38142884-61930969 is NOT ready for SSH connections, VM status: ACTIVE
2026-10-05 05:12:25,864 - DEBUG - verify_vm_launched is skipped since self.vm_launch_flag is set
2026-10-05 05:12:25,864 - DEBUG - Waiting to SSH to VM ctest-TestBGPaasZone-38142884-61930969, IP 74.5.232.3, Port 22
2026-10-05 05:12:25,943 - DEBUG - Error on ssh to ubuntu@169.254.0.7:22, result: /bin/bash: connect: Connection refused
/bin/bash: line 1: /dev/tcp/169.254.0.7/22: Connection refused {'failed': True, 'command': '(echo > /dev/tcp/169.254.0.7/22)', 'real_command': '/bin/bash -l -c "(echo > /dev/tcp/169.254.0.7/22)"', 'return_code': 1, 'succeeded': False, 'stderr': ''}
2026-10-05 05:12:26,046 - DEBUG - VM ctest-TestBGPaasZone-38142884-61930969 is NOT ready for SSH connections, VM status: ACTIVE
2026-10-05 05:12:31,046 - DEBUG - verify_vm_launched is skipped since self.vm_launch_flag is set
2026-10-05 05:12:31,046 - DEBUG - Waiting to SSH to VM ctest-TestBGPaasZone-38142884-61930969, IP 74.5.232.3, Port 22
2026-10-05 05:12:31,135 - DEBUG - Error on ssh to ubuntu@169.254.0.7:22, result: /bin/bash: connect: Connection refused
/bin/bash: line 1: /dev/tcp/169.254.0.7/22: Connection refused {'failed': True, 'command': '(echo > /dev/tcp/169.254.0.7/22)', 'real_command': '/bin/bash -l -c "(echo > /dev/tcp/169.254.0.7/22)"', 'return_code': 1, 'succeeded': False, 'stderr': ''}
2026-10-05 05:12:31,254 - DEBUG - VM ctest-TestBGPaasZone-38142884-61930969 is NOT ready for SSH connections, VM status: ACTIVE
2026-10-05 05:12:36,255 - DEBUG - verify_vm_launched is skipped since self.vm_launch_flag is set
2026-10-05 05:12:36,255 - DEBUG - Waiting to SSH to VM ctest-TestBGPaasZone-38142884-61930969, IP 74.5.232.3, Port 22
2026-10-05 05:12:36,324 - DEBUG - Error on ssh to ubuntu@169.254.0.7:22, result: /bin/bash: connect: Connection refused
/bin/bash: line 1: /dev/tcp/169.254.0.7/22: Connection refused {'failed': True, 'command': '(echo > /dev/tcp/169.254.0.7/22)', 'real_command': '/bin/bash -l -c "(echo > /dev/tcp/169.254.0.7/22)"', 'return_code': 1, 'succeeded': False, 'stderr': ''}
2026-10-05 05:12:36,427 - DEBUG - VM ctest-TestBGPaasZone-38142884-61930969 is NOT ready for SSH connections, VM status: ACTIVE
2026-10-05 05:12:41,428 - DEBUG - verify_vm_launched is skipped since self.vm_launch_flag is set
2026-10-05 05:12:41,429 - DEBUG - Waiting to SSH to VM ctest-TestBGPaasZone-38142884-61930969, IP 74.5.232.3, Port 22
2026-10-05 05:12:41,496 - DEBUG - Error on ssh to ubuntu@169.254.0.7:22, result: /bin/bash: connect: Connection refused
/bin/bash: line 1: /dev/tcp/169.254.0.7/22: Connection refused {'failed': True, 'command': '(echo > /dev/tcp/169.254.0.7/22)', 'real_command': '/bin/bash -l -c "(echo > /dev/tcp/169.254.0.7/22)"', 'return_code': 1, 'succeeded': False, 'stderr': ''}
2026-10-05 05:12:41,608 - DEBUG - VM ctest-TestBGPaasZone-38142884-61930969 is NOT ready for SSH connections, VM status: ACTIVE
2026-10-05 05:12:46,609 - DEBUG - verify_vm_launched is skipped since self.vm_launch_flag is set
2026-10-05 05:12:46,609 - DEBUG - Waiting to SSH to VM ctest-TestBGPaasZone-38142884-61930969, IP 74.5.232.3, Port 22
2026-10-05 05:12:46,680 - DEBUG - Error on ssh to ubuntu@169.254.0.7:22, result: /bin/bash: connect: Connection refused
/bin/bash: line 1: /dev/tcp/169.254.0.7/22: Connection refused {'failed': True, 'command': '(echo > /dev/tcp/169.254.0.7/22)', 'real_command': '/bin/bash -l -c "(echo > /dev/tcp/169.254.0.7/22)"', 'return_code': 1, 'succeeded': False, 'stderr': ''}
2026-10-05 05:12:46,780 - DEBUG - VM ctest-TestBGPaasZone-38142884-61930969 is NOT ready for SSH connections, VM status: ACTIVE
2026-10-05 05:12:51,781 - DEBUG - verify_vm_launched is skipped since self.vm_launch_flag is set
2026-10-05 05:12:51,781 - DEBUG - Waiting to SSH to VM ctest-TestBGPaasZone-38142884-61930969, IP 74.5.232.3, Port 22
2026-10-05 05:12:51,848 - DEBUG - Error on ssh to ubuntu@169.254.0.7:22, result: /bin/bash: connect: Connection refused
/bin/bash: line 1: /dev/tcp/169.254.0.7/22: Connection refused {'failed': True, 'command': '(echo > /dev/tcp/169.254.0.7/22)', 'real_command': '/bin/bash -l -c "(echo > /dev/tcp/169.254.0.7/22)"', 'return_code': 1, 'succeeded': False, 'stderr': ''}
2026-10-05 05:12:51,961 - DEBUG - VM ctest-TestBGPaasZone-38142884-61930969 is NOT ready for SSH connections, VM status: ACTIVE
2026-10-05 05:12:56,962 - DEBUG - verify_vm_launched is skipped since self.vm_launch_flag is set
2026-10-05 05:12:56,962 - DEBUG - Waiting to SSH to VM ctest-TestBGPaasZone-38142884-61930969, IP 74.5.232.3, Port 22
2026-10-05 05:12:57,029 - DEBUG - Error on ssh to ubuntu@169.254.0.7:22, result: /bin/bash: connect: Connection refused
/bin/bash: line 1: /dev/tcp/169.254.0.7/22: Connection refused {'failed': True, 'command': '(echo > /dev/tcp/169.254.0.7/22)', 'real_command': '/bin/bash -l -c "(echo > /dev/tcp/169.254.0.7/22)"', 'return_code': 1, 'succeeded': False, 'stderr': ''}
2026-10-05 05:12:57,155 - DEBUG - VM ctest-TestBGPaasZone-38142884-61930969 is NOT ready for SSH connections, VM status: ACTIVE
2026-10-05 05:13:02,157 - DEBUG - verify_vm_launched is skipped since self.vm_launch_flag is set
2026-10-05 05:13:02,157 - DEBUG - Waiting to SSH to VM ctest-TestBGPaasZone-38142884-61930969, IP 74.5.232.3, Port 22
2026-10-05 05:13:02,225 - DEBUG - Error on ssh to ubuntu@169.254.0.7:22, result: /bin/bash: connect: Connection refused
/bin/bash: line 1: /dev/tcp/169.254.0.7/22: Connection refused {'failed': True, 'command': '(echo > /dev/tcp/169.254.0.7/22)', 'real_command': '/bin/bash -l -c "(echo > /dev/tcp/169.254.0.7/22)"', 'return_code': 1, 'succeeded': False, 'stderr': ''}
2026-10-05 05:13:02,323 - DEBUG - VM ctest-TestBGPaasZone-38142884-61930969 is NOT ready for SSH connections, VM status: ACTIVE
2026-10-05 05:13:07,324 - DEBUG - verify_vm_launched is skipped since self.vm_launch_flag is set
2026-10-05 05:13:07,325 - DEBUG - Waiting to SSH to VM ctest-TestBGPaasZone-38142884-61930969, IP 74.5.232.3, Port 22
2026-10-05 05:13:07,403 - DEBUG - Error on ssh to ubuntu@169.254.0.7:22, result: /bin/bash: connect: Connection refused
/bin/bash: line 1: /dev/tcp/169.254.0.7/22: Connection refused {'failed': True, 'command': '(echo > /dev/tcp/169.254.0.7/22)', 'real_command': '/bin/bash -l -c "(echo > /dev/tcp/169.254.0.7/22)"', 'return_code': 1, 'succeeded': False, 'stderr': ''}
2026-10-05 05:13:07,515 - DEBUG - VM ctest-TestBGPaasZone-38142884-61930969 is NOT ready for SSH connections, VM status: ACTIVE
2026-10-05 05:13:12,517 - DEBUG - verify_vm_launched is skipped since self.vm_launch_flag is set
2026-10-05 05:13:12,517 - DEBUG - Waiting to SSH to VM ctest-TestBGPaasZone-38142884-61930969, IP 74.5.232.3, Port 22
2026-10-05 05:13:12,585 - DEBUG - Error on ssh to ubuntu@169.254.0.7:22, result: /bin/bash: connect: Connection refused
/bin/bash: line 1: /dev/tcp/169.254.0.7/22: Connection refused {'failed': True, 'command': '(echo > /dev/tcp/169.254.0.7/22)', 'real_command': '/bin/bash -l -c "(echo > /dev/tcp/169.254.0.7/22)"', 'return_code': 1, 'succeeded': False, 'stderr': ''}
2026-10-05 05:13:12,683 - DEBUG - VM ctest-TestBGPaasZone-38142884-61930969 is NOT ready for SSH connections, VM status: ACTIVE
2026-10-05 05:13:17,684 - DEBUG - verify_vm_launched is skipped since self.vm_launch_flag is set
2026-10-05 05:13:17,684 - DEBUG - Waiting to SSH to VM ctest-TestBGPaasZone-38142884-61930969, IP 74.5.232.3, Port 22
2026-10-05 05:13:17,752 - DEBUG - Error on ssh to ubuntu@169.254.0.7:22, result: /bin/bash: connect: Connection refused
/bin/bash: line 1: /dev/tcp/169.254.0.7/22: Connection refused {'failed': True, 'command': '(echo > /dev/tcp/169.254.0.7/22)', 'real_command': '/bin/bash -l -c "(echo > /dev/tcp/169.254.0.7/22)"', 'return_code': 1, 'succeeded': False, 'stderr': ''}
2026-10-05 05:13:17,846 - DEBUG - VM ctest-TestBGPaasZone-38142884-61930969 is NOT ready for SSH connections, VM status: ACTIVE
2026-10-05 05:13:22,847 - DEBUG - verify_vm_launched is skipped since self.vm_launch_flag is set
2026-10-05 05:13:22,848 - DEBUG - Waiting to SSH to VM ctest-TestBGPaasZone-38142884-61930969, IP 74.5.232.3, Port 22
2026-10-05 05:13:22,917 - DEBUG - Error on ssh to ubuntu@169.254.0.7:22, result: /bin/bash: connect: Connection refused
/bin/bash: line 1: /dev/tcp/169.254.0.7/22: Connection refused {'failed': True, 'command': '(echo > /dev/tcp/169.254.0.7/22)', 'real_command': '/bin/bash -l -c "(echo > /dev/tcp/169.254.0.7/22)"', 'return_code': 1, 'succeeded': False, 'stderr': ''}
2026-10-05 05:13:23,006 - DEBUG - VM ctest-TestBGPaasZone-38142884-61930969 is NOT ready for SSH connections, VM status: ACTIVE
2026-10-05 05:13:28,007 - DEBUG - verify_vm_launched is skipped since self.vm_launch_flag is set
2026-10-05 05:13:28,007 - DEBUG - Waiting to SSH to VM ctest-TestBGPaasZone-38142884-61930969, IP 74.5.232.3, Port 22
2026-10-05 05:13:28,184 - DEBUG - VM ctest-TestBGPaasZone-38142884-61930969 is ready for SSH connections
2026-10-05 05:13:28,184 - INFO - Waiting for VM ctest-TestBGPaasZone-38142884-92059372 to be up..
2026-10-05 05:13:28,251 - DEBUG - VM is still in BUILD state, Expected: ACTIVE
2026-10-05 05:13:33,308 - DEBUG - VM is still in BUILD state, Expected: ACTIVE
2026-10-05 05:13:38,373 - DEBUG - VM is still in BUILD state, Expected: ACTIVE
2026-10-05 05:13:43,435 - DEBUG - VM is still in BUILD state, Expected: ACTIVE
2026-10-05 05:13:48,492 - DEBUG - VM is still in BUILD state, Expected: ACTIVE
2026-10-05 05:13:53,550 - DEBUG - VM is still in BUILD state, Expected: ACTIVE
2026-10-05 05:13:58,621 - DEBUG - VM is still in BUILD state, Expected: ACTIVE
2026-10-05 05:14:03,678 - DEBUG - VM is still in BUILD state, Expected: ACTIVE
2026-10-05 05:14:08,738 - DEBUG - VM is still in BUILD state, Expected: ACTIVE
2026-10-05 05:14:13,796 - DEBUG - VM is still in BUILD state, Expected: ACTIVE
2026-10-05 05:14:18,859 - DEBUG - VM is still in BUILD state, Expected: ACTIVE
2026-10-05 05:14:23,927 - DEBUG - VM is still in BUILD state, Expected: ACTIVE
2026-10-05 05:14:28,987 - DEBUG - VM is still in BUILD state, Expected: ACTIVE
2026-10-05 05:14:34,052 - DEBUG - VM is still in BUILD state, Expected: ACTIVE
2026-10-05 05:14:39,117 - DEBUG - VM is still in BUILD state, Expected: ACTIVE
2026-10-05 05:14:44,176 - DEBUG - VM is still in BUILD state, Expected: ACTIVE
2026-10-05 05:14:49,295 - DEBUG - VM is still in BUILD state, Expected: ACTIVE
2026-10-05 05:14:54,380 - DEBUG - VM is still in BUILD state, Expected: ACTIVE
2026-10-05 05:14:59,468 - DEBUG - VM is still in BUILD state, Expected: ACTIVE
2026-10-05 05:15:04,532 - DEBUG - VM is still in BUILD state, Expected: ACTIVE
2026-10-05 05:15:09,620 - DEBUG - VM is still in BUILD state, Expected: ACTIVE
2026-10-05 05:15:14,680 - DEBUG - VM is still in BUILD state, Expected: ACTIVE
2026-10-05 05:15:19,746 - DEBUG - VM is still in BUILD state, Expected: ACTIVE
2026-10-05 05:15:24,829 - DEBUG - VM is still in BUILD state, Expected: ACTIVE
2026-10-05 05:15:29,891 - DEBUG - VM is still in BUILD state, Expected: ACTIVE
2026-10-05 05:15:34,953 - DEBUG - VM is still in BUILD state, Expected: ACTIVE
2026-10-05 05:15:40,019 - DEBUG - VM is still in BUILD state, Expected: ACTIVE
2026-10-05 05:15:45,076 - DEBUG - VM is still in BUILD state, Expected: ACTIVE
2026-10-05 05:15:50,139 - DEBUG - VM is still in BUILD state, Expected: ACTIVE
2026-10-05 05:15:55,197 - DEBUG - VM is still in BUILD state, Expected: ACTIVE
2026-10-05 05:16:00,264 - DEBUG - VM is still in BUILD state, Expected: ACTIVE
2026-10-05 05:16:00,264 - ERROR - VM is not in ACTIVE state
2026-10-05 05:16:00,396 - ERROR - Fatal Nova Exception while getting VM detail
2026-10-05 05:16:00,396 - DEBUG - None
2026-10-05 05:16:00,396 - ERROR - VM ctest-TestBGPaasZone-38142884-92059372 has not booted
2026-10-05 05:16:00,396 - INFO - Deleting VM ctest-TestBGPaasZone-38142884-61930969
2026-10-05 05:16:00,521 - INFO - Skip interface_detach for VM ctest-TestBGPaasZone-38142884-92059372 in state BUILD
2026-10-05 05:16:00,522 - INFO - Deleting VM ctest-TestBGPaasZone-38142884-92059372
2026-10-05 05:16:00,522 - ERROR - VM ctest-TestBGPaasZone-38142884-92059372 has failed to come up
2026-10-05 05:16:00,522 - ERROR - Nova failed to get host of the VM
2026-10-05 05:16:00,522 - ERROR - VM ctest-TestBGPaasZone-38142884-92059372 has failed to come up
2026-10-05 05:16:00,522 - ERROR - Nova failed to get host of the VM
2026-10-05 05:16:00,736 - INFO - Skip interface_detach for VM ctest-TestBGPaasZone-38142884-34517296 in state BUILD
2026-10-05 05:16:00,736 - INFO - Deleting VM ctest-TestBGPaasZone-38142884-34517296
2026-10-05 05:16:00,736 - ERROR - VM ctest-TestBGPaasZone-38142884-34517296 has failed to come up
2026-10-05 05:16:00,736 - ERROR - Nova failed to get host of the VM
2026-10-05 05:16:00,736 - ERROR - VM ctest-TestBGPaasZone-38142884-34517296 has failed to come up
2026-10-05 05:16:00,736 - ERROR - Nova failed to get host of the VM
2026-10-05 05:16:00,831 - INFO - Skip interface_detach for VM ctest-TestBGPaasZone-38142884-34517296 in state BUILD
2026-10-05 05:16:00,835 - INFO - Skip interface_detach for VM ctest-TestBGPaasZone-38142884-92059372 in state BUILD
2026-10-05 05:16:00,835 - INFO - Deleting VN ctest-cnz_vn-19205794
2026-10-05 05:16:00,899 - DEBUG - VN 6197eb9e-4c90-46dd-95c3-4b3e0b2cb669 still in use: Unable to complete operation on network 6197eb9e-4c90-46dd-95c3-4b3e0b2cb669. There are one or more ports still in use on the network.
Neutron server returns request_ids: ['req-01380a31-a4ad-4b42-90a5-5fc255f05978']
2026-10-05 05:16:00,899 - WARNING - Deleting VN ctest-cnz_vn-19205794 failed..Will retry
2026-10-05 05:16:02,961 - DEBUG - VN 6197eb9e-4c90-46dd-95c3-4b3e0b2cb669 still in use: Unable to complete operation on network 6197eb9e-4c90-46dd-95c3-4b3e0b2cb669. There are one or more ports still in use on the network.
Neutron server returns request_ids: ['req-77782ef6-4d26-4ea0-9b4c-46730e3391b4']
2026-10-05 05:16:02,961 - WARNING - Deleting VN ctest-cnz_vn-19205794 failed..Will retry
2026-10-05 05:16:05,176 - DEBUG - Response for deleting network ()
2026-10-05 05:16:06,479 - ERROR - AssertionError
Python 3.9.25: /usr/bin/python3
Mon Oct 5 05:16:00 2026
A problem occurred in a Python script. Here is the sequence of
function calls leading up to the error, in the order they occurred.
/contrail-test/tcutils/wrappers.py in wrapper(self=, *args=(), **kwargs={})
78 log.info('Initial checks done. Running the testcase now')
79 log.info('')
80 result = function(self, *args, **kwargs)
81 if self.inputs.upgrade:
82 pid = os.getpid()
result = None
function =
self =
args = ()
kwargs = {}
/contrail-test/serial_scripts/bgpaas/test_bgpaas_zone.py in test_bgp_control_node_zone(self=)
57 cnt = 0
58 self.logger.info('executing bgp_control_zone test')
59 assert self.basic_control_node_zone_setup()
60 # update control node zone with different bgp routers
61 self.update_control_node_zones(self.cnzs)
self =
self.basic_control_node_zone_setup = >
/contrail-test/serial_scripts/bgpaas/test_bgpaas_zone.py in basic_control_node_zone_setup(self=, ctrl_zone=None)
31 self.vms.append(self.create_vm(vn_fixture=self.vn, image_name='ubuntu-bird'))
32 self.client_vm = self.create_vm(vn_fixture=self.vn, image_name='ubuntu-bird')
33 self.check_vms_booted(self.vms + [self.client_vm])
34 for bgp_name in self.inputs.bgp_names:
35 self.cnzs += self.create_control_node_zones("test-zone",[bgp_name])
self =
self.check_vms_booted = >
self.vms = [, ]
self.client_vm =
/contrail-test/common/base.py in check_vms_booted(cls=, vms_list=[, , ], do_assert=True)
720 for vm_fixture in vms_list:
721 vm_fixture.cleanUp()
722 assert False, 'One or more vm-boots failed. Check logs'
723 if failed:
724 return False
AssertionError: One or more vm-boots failed. Check logs
__cause__ = None
__class__ =
__context__ = None
__delattr__ =
__dict__ = {}
__dir__ =
__doc__ = 'Assertion failed.'
__eq__ =
__format__ =
__ge__ =
__getattribute__ =
__gt__ =
__hash__ =
__init__ =
__init_subclass__ =
__le__ =
__lt__ =
__ne__ =
__new__ =
__reduce__ =
__reduce_ex__ =
__repr__ =
__setattr__ =
__setstate__ =
__sizeof__ =
__str__ =
__subclasshook__ =
__suppress_context__ = False
__traceback__ =
args = ('One or more vm-boots failed. Check logs',)
with_traceback =
The above is a description of an error in a Python program. Here is
the original traceback:
Traceback (most recent call last):
File "/contrail-test/tcutils/wrappers.py", line 80, in wrapper
result = function(self, *args, **kwargs)
File "/contrail-test/serial_scripts/bgpaas/test_bgpaas_zone.py", line 59, in test_bgp_control_node_zone
assert self.basic_control_node_zone_setup()
File "/contrail-test/serial_scripts/bgpaas/test_bgpaas_zone.py", line 33, in basic_control_node_zone_setup
self.check_vms_booted(self.vms + [self.client_vm])
File "/contrail-test/common/base.py", line 722, in check_vms_booted
assert False, 'One or more vm-boots failed. Check logs'
AssertionError: One or more vm-boots failed. Check logs
2026-10-05 05:16:06,479 - DEBUG - Skipping xmpp flap check
2026-10-05 05:16:06,480 - INFO -
2026-10-05 05:16:06,480 - INFO - END TEST : test_bgp_control_node_zone : FAILED[0:06:21]
2026-10-05 05:16:06,480 - INFO - --------------------------------------------------------------------------------
2026-10-05 05:16:06,483 - INFO - ================================================================================
2026-10-05 05:16:06,483 - INFO - STARTING TEST : test_bgp_control_node_zones_from_single_vnf
2026-10-05 05:16:07,839 - DEBUG - Skipping xmpp flap check
2026-10-05 05:16:07,839 - INFO - Initial checks done. Running the testcase now
2026-10-05 05:16:07,840 - INFO -
2026-10-05 05:16:07,840 - INFO - executing bgp_control_zone agent restart test
2026-10-05 05:16:08,266 - DEBUG - Response for create_network : {'network': {'id': 'b386bbca-8cb5-4692-ba8d-1ce156437fe5', 'name': 'ctest-cnz_vn-05963721', 'tenant_id': '41051239dabc4a3cbc479964a7a0273a', 'project_id': '41051239dabc4a3cbc479964a7a0273a', 'admin_state_up': True, 'shared': False, 'status': 'ACTIVE', 'router:external': False, 'mtu': 0, 'tags': [], 'subnets': [], 'fq_name': ['default-domain', 'ctest-TestBGPaasZone-38142884', 'ctest-cnz_vn-05963721'], 'port_security_enabled': True, 'description': ''}}
2026-10-05 05:16:08,545 - DEBUG - Response for create_subnet : {'subnet': {'id': '0415c079-4763-4673-a382-02ec788eca98', 'name': '', 'tenant_id': '41051239dabc4a3cbc479964a7a0273a', 'network_id': 'b386bbca-8cb5-4692-ba8d-1ce156437fe5', 'ip_version': 4, 'cidr': '20.147.88.0/26', 'allocation_pools': [{'start': '20.147.88.2', 'end': '20.147.88.62'}], 'gateway_ip': '20.147.88.1', 'enable_dhcp': True, 'ipv6_ra_mode': None, 'ipv6_address_mode': None, 'dns_nameservers': [], 'host_routes': [], 'dns_server_address': '20.147.88.2', 'tags': [], 'project_id': '41051239dabc4a3cbc479964a7a0273a'}}
2026-10-05 05:16:08,572 - INFO - Created VN ctest-cnz_vn-05963721
2026-10-05 05:16:08,588 - DEBUG - VN ctest-cnz_vn-05963721 UUID is b386bbca-8cb5-4692-ba8d-1ce156437fe5
2026-10-05 05:16:09,583 - INFO - VM ([]) created on node: (an-jenkins-deploy-platform-ansible-os-6343-2), Zone: (nova:an-jenkins-deploy-platform-ansible-os-6343-2)
2026-10-05 05:16:10,731 - INFO - VM ([]) created on node: (an-jenkins-deploy-platform-ansible-os-6343-1), Zone: (nova:an-jenkins-deploy-platform-ansible-os-6343-1)
2026-10-05 05:16:11,781 - INFO - VM ([]) created on node: (an-jenkins-deploy-platform-ansible-os-6343-2), Zone: (nova:an-jenkins-deploy-platform-ansible-os-6343-2)
2026-10-05 05:16:11,782 - INFO - Waiting for VM ctest-TestBGPaasZone-38142884-86148002 to be up..
2026-10-05 05:16:11,851 - DEBUG - VM is still in BUILD state, Expected: ACTIVE
2026-10-05 05:16:16,908 - DEBUG - VM is still in BUILD state, Expected: ACTIVE
2026-10-05 05:16:21,980 - DEBUG - VM is still in BUILD state, Expected: ACTIVE
2026-10-05 05:16:27,068 - DEBUG - VM is still in BUILD state, Expected: ACTIVE
2026-10-05 05:16:32,134 - DEBUG - VM is still in BUILD state, Expected: ACTIVE
2026-10-05 05:16:37,201 - DEBUG - VM is still in BUILD state, Expected: ACTIVE
2026-10-05 05:16:42,265 - DEBUG - VM is still in BUILD state, Expected: ACTIVE
2026-10-05 05:16:47,325 - DEBUG - VM is still in BUILD state, Expected: ACTIVE
2026-10-05 05:16:52,389 - DEBUG - VM is still in BUILD state, Expected: ACTIVE
2026-10-05 05:16:57,455 - DEBUG - VM is still in BUILD state, Expected: ACTIVE
2026-10-05 05:17:02,516 - DEBUG - VM is still in BUILD state, Expected: ACTIVE
2026-10-05 05:17:07,580 - DEBUG - VM is still in BUILD state, Expected: ACTIVE
2026-10-05 05:17:12,640 - DEBUG - VM is still in BUILD state, Expected: ACTIVE
2026-10-05 05:17:17,755 - DEBUG - VM is still in BUILD state, Expected: ACTIVE
2026-10-05 05:17:22,817 - DEBUG - VM is still in BUILD state, Expected: ACTIVE
2026-10-05 05:17:27,878 - DEBUG - VM is still in BUILD state, Expected: ACTIVE
2026-10-05 05:17:32,936 - DEBUG - VM is still in BUILD state, Expected: ACTIVE
2026-10-05 05:17:37,995 - DEBUG - VM is still in BUILD state, Expected: ACTIVE
2026-10-05 05:17:43,070 - DEBUG - VM is still in BUILD state, Expected: ACTIVE
2026-10-05 05:17:48,128 - DEBUG - VM is still in BUILD state, Expected: ACTIVE
2026-10-05 05:17:53,188 - DEBUG - VM is still in BUILD state, Expected: ACTIVE
2026-10-05 05:17:58,253 - DEBUG - VM is still in BUILD state, Expected: ACTIVE
2026-10-05 05:18:03,338 - DEBUG - VM is still in BUILD state, Expected: ACTIVE
2026-10-05 05:18:08,395 - DEBUG - VM is still in BUILD state, Expected: ACTIVE
2026-10-05 05:18:13,473 - DEBUG - VM is still in BUILD state, Expected: ACTIVE
2026-10-05 05:18:18,528 - DEBUG - VM is still in BUILD state, Expected: ACTIVE
2026-10-05 05:18:23,588 - DEBUG - VM is still in BUILD state, Expected: ACTIVE
2026-10-05 05:18:28,683 - DEBUG - VM is still in BUILD state, Expected: ACTIVE
2026-10-05 05:18:33,749 - DEBUG - VM is still in BUILD state, Expected: ACTIVE
2026-10-05 05:18:38,806 - DEBUG - VM is still in BUILD state, Expected: ACTIVE
2026-10-05 05:18:43,875 - DEBUG - VM is still in BUILD state, Expected: ACTIVE
2026-10-05 05:18:43,875 - ERROR - VM is not in ACTIVE state
2026-10-05 05:18:43,973 - ERROR - Fatal Nova Exception while getting VM detail
2026-10-05 05:18:43,973 - DEBUG - None
2026-10-05 05:18:43,973 - ERROR - VM ctest-TestBGPaasZone-38142884-86148002 has not booted
2026-10-05 05:18:43,973 - INFO - Skip interface_detach for VM ctest-TestBGPaasZone-38142884-86148002 in state BUILD
2026-10-05 05:18:43,973 - INFO - Deleting VM ctest-TestBGPaasZone-38142884-86148002
2026-10-05 05:18:43,973 - ERROR - VM ctest-TestBGPaasZone-38142884-86148002 has failed to come up
2026-10-05 05:18:43,973 - ERROR - Nova failed to get host of the VM
2026-10-05 05:18:43,973 - ERROR - VM ctest-TestBGPaasZone-38142884-86148002 has failed to come up
2026-10-05 05:18:43,973 - ERROR - Nova failed to get host of the VM
2026-10-05 05:18:44,168 - INFO - Skip interface_detach for VM ctest-TestBGPaasZone-38142884-08810107 in state BUILD
2026-10-05 05:18:44,168 - INFO - Deleting VM ctest-TestBGPaasZone-38142884-08810107
2026-10-05 05:18:44,168 - ERROR - VM ctest-TestBGPaasZone-38142884-08810107 has failed to come up
2026-10-05 05:18:44,169 - ERROR - Nova failed to get host of the VM
2026-10-05 05:18:44,169 - ERROR - VM ctest-TestBGPaasZone-38142884-08810107 has failed to come up
2026-10-05 05:18:44,169 - ERROR - Nova failed to get host of the VM
2026-10-05 05:18:44,247 - INFO - Skip interface_detach for VM ctest-TestBGPaasZone-38142884-30093862 in state BUILD
2026-10-05 05:18:44,247 - INFO - Deleting VM ctest-TestBGPaasZone-38142884-30093862
2026-10-05 05:18:44,248 - ERROR - VM ctest-TestBGPaasZone-38142884-30093862 has failed to come up
2026-10-05 05:18:44,248 - ERROR - Nova failed to get host of the VM
2026-10-05 05:18:44,248 - ERROR - VM ctest-TestBGPaasZone-38142884-30093862 has failed to come up
2026-10-05 05:18:44,248 - ERROR - Nova failed to get host of the VM
2026-10-05 05:18:44,403 - INFO - Skip interface_detach for VM ctest-TestBGPaasZone-38142884-30093862 in state BUILD
2026-10-05 05:18:44,403 - INFO - Skip interface_detach for VM ctest-TestBGPaasZone-38142884-08810107 in state BUILD
2026-10-05 05:18:44,403 - INFO - Skip interface_detach for VM ctest-TestBGPaasZone-38142884-86148002 in state BUILD
2026-10-05 05:18:44,403 - INFO - Deleting VN ctest-cnz_vn-05963721
2026-10-05 05:18:44,452 - DEBUG - VN b386bbca-8cb5-4692-ba8d-1ce156437fe5 still in use: Unable to complete operation on network b386bbca-8cb5-4692-ba8d-1ce156437fe5. There are one or more ports still in use on the network.
Neutron server returns request_ids: ['req-d81dcbbb-952f-4901-b054-057f68481570']
2026-10-05 05:18:44,453 - WARNING - Deleting VN ctest-cnz_vn-05963721 failed..Will retry
2026-10-05 05:18:46,656 - DEBUG - Response for deleting network ()
2026-10-05 05:18:47,984 - ERROR - AssertionError
Python 3.9.25: /usr/bin/python3
Mon Oct 5 05:18:44 2026
A problem occurred in a Python script. Here is the sequence of
function calls leading up to the error, in the order they occurred.
/contrail-test/tcutils/wrappers.py in wrapper(self=, *args=(), **kwargs={})
78 log.info('Initial checks done. Running the testcase now')
79 log.info('')
80 result = function(self, *args, **kwargs)
81 if self.inputs.upgrade:
82 pid = os.getpid()
result = None
function =
self =
args = ()
kwargs = {}
/contrail-test/serial_scripts/bgpaas/test_bgpaas_zone.py in test_bgp_control_node_zones_from_single_vnf(self=)
145 self.logger.info('executing bgp_control_zone agent restart test')
146 host_ips = []
147 assert self.basic_control_node_zone_setup('both-zones')
148 for vm in self.vms:
149 assert self.verify_bgpaas_in_control_nodes_and_agent(self.bgpaas_fixtures[cnt],vm)
self =
self.basic_control_node_zone_setup = >
/contrail-test/serial_scripts/bgpaas/test_bgpaas_zone.py in basic_control_node_zone_setup(self=, ctrl_zone='both-zones')
31 self.vms.append(self.create_vm(vn_fixture=self.vn, image_name='ubuntu-bird'))
32 self.client_vm = self.create_vm(vn_fixture=self.vn, image_name='ubuntu-bird')
33 self.check_vms_booted(self.vms + [self.client_vm])
34 for bgp_name in self.inputs.bgp_names:
35 self.cnzs += self.create_control_node_zones("test-zone",[bgp_name])
self =
self.check_vms_booted = >
self.vms = [, ]
self.client_vm =
/contrail-test/common/base.py in check_vms_booted(cls=, vms_list=[, , ], do_assert=True)
720 for vm_fixture in vms_list:
721 vm_fixture.cleanUp()
722 assert False, 'One or more vm-boots failed. Check logs'
723 if failed:
724 return False
AssertionError: One or more vm-boots failed. Check logs
__cause__ = None
__class__ =
__context__ = None
__delattr__ =
__dict__ = {}
__dir__ =
__doc__ = 'Assertion failed.'
__eq__ =
__format__ =
__ge__ =
__getattribute__ =
__gt__ =
__hash__ =
__init__ =
__init_subclass__ =
__le__ =
__lt__ =
__ne__ =
__new__ =
__reduce__ =
__reduce_ex__ =
__repr__ =
__setattr__ =
__setstate__ =
__sizeof__ =
__str__ =
__subclasshook__ =
__suppress_context__ = False
__traceback__ =
args = ('One or more vm-boots failed. Check logs',)
with_traceback =
The above is a description of an error in a Python program. Here is
the original traceback:
Traceback (most recent call last):
File "/contrail-test/tcutils/wrappers.py", line 80, in wrapper
result = function(self, *args, **kwargs)
File "/contrail-test/serial_scripts/bgpaas/test_bgpaas_zone.py", line 147, in test_bgp_control_node_zones_from_single_vnf
assert self.basic_control_node_zone_setup('both-zones')
File "/contrail-test/serial_scripts/bgpaas/test_bgpaas_zone.py", line 33, in basic_control_node_zone_setup
self.check_vms_booted(self.vms + [self.client_vm])
File "/contrail-test/common/base.py", line 722, in check_vms_booted
assert False, 'One or more vm-boots failed. Check logs'
AssertionError: One or more vm-boots failed. Check logs
2026-10-05 05:18:47,984 - DEBUG - Skipping xmpp flap check
2026-10-05 05:18:47,985 - INFO -
2026-10-05 05:18:47,985 - INFO - END TEST : test_bgp_control_node_zones_from_single_vnf : FAILED[0:02:41]
2026-10-05 05:18:47,985 - INFO - --------------------------------------------------------------------------------
2026-10-05 05:18:48,926 - INFO - Deleted project: ctest-TestBGPaasZone-38142884, ID : 41051239-dabc-4a3c-bc47-9964a7a0273a