2026-10-05 04:03:45,407 - INFO - Domain Default found not creating
2026-10-05 04:03:45,602 - INFO - Project ctest-SecurityGroupBasicRegressionTests1-37697791 not found, creating it
2026-10-05 04:03:46,203 - INFO - Created Project:ctest-SecurityGroupBasicRegressionTests1-37697791, ID : c6b61d79-85a5-455a-b313-7787be66bec9
2026-10-05 04:03:48,014 - INFO - ================================================================================
2026-10-05 04:03:48,015 - INFO - STARTING TEST : test_sec_group_basic
2026-10-05 04:03:48,015 - INFO - TEST DESCRIPTION :
Description: Test basic SG features
1. Security group create and delete
2. Create security group with custom rules and then update it for tcp
3. Launch VM with custom created security group and verify
4. Remove secuity group association with VM
5. Add back custom security group to VM and verify
6. Test with ping, which should fail
7. Test with TCP which should pass
8. Update the rules to allow icmp, ping should pass now
9. Delete security group while ports still reference it; SG is
detached from VMs and removed (Neutron and Contrail API)
2026-10-05 04:03:49,341 - DEBUG - Nothing to compare xmpp stats {'10.0.0.50': {'10.20.0.14': '0', '10.20.0.25': '0'}, '10.0.0.191': {'10.20.0.254': '0', '10.20.0.25': '0'}} with
2026-10-05 04:03:49,341 - INFO - Initial checks done. Running the testcase now
2026-10-05 04:03:49,341 - INFO -
2026-10-05 04:03:49,824 - INFO - Creating Security group: ['default-domain', 'ctest-SecurityGroupBasicRegressionTests1-37697791', 'ctest-test_sec_group-54048221']
2026-10-05 04:03:51,287 - DEBUG - Security group: ['default-domain', 'ctest-SecurityGroupBasicRegressionTests1-37697791', 'ctest-test_sec_group-54048221'] created succesfully
2026-10-05 04:03:51,287 - DEBUG - Requesting: http://10.0.0.177:8082/domains
2026-10-05 04:03:51,686 - DEBUG - Requesting: http://10.0.0.177:8082/domains
2026-10-05 04:03:51,734 - DEBUG - Requesting: http://10.0.0.177:8082/domain/6850e378-7089-4036-8f54-55c0ed1b9054
2026-10-05 04:03:51,754 - DEBUG - Requesting: http://10.0.0.177:8082/project/c6b61d79-85a5-455a-b313-7787be66bec9
2026-10-05 04:03:51,874 - DEBUG - Requesting: http://10.0.0.177:8082/security-group/8e0b3d30-4569-44af-9b28-fed785ea88fe
2026-10-05 04:03:51,897 - INFO - Security group ctest-test_sec_group-54048221 found in the API Server
2026-10-05 04:03:51,898 - DEBUG - Requesting: http://10.0.0.177:8082/domains
2026-10-05 04:03:51,909 - DEBUG - Requesting: http://10.0.0.177:8082/domain/6850e378-7089-4036-8f54-55c0ed1b9054
2026-10-05 04:03:51,925 - DEBUG - Requesting: http://10.0.0.177:8082/project/c6b61d79-85a5-455a-b313-7787be66bec9
2026-10-05 04:03:52,056 - DEBUG - Requesting: http://10.0.0.177:8082/access-control-lists
2026-10-05 04:03:52,072 - INFO - Validated that ACLs for Security group ctest-test_sec_group-54048221 are present in API Server
2026-10-05 04:03:52,085 - INFO - Validated that Security group ctest-test_sec_group-54048221 is found in control node 10.0.0.177
2026-10-05 04:03:52,094 - DEBUG - Security group ctest-test_sec_group-54048221 ACLs found in the control node 10.0.0.177
2026-10-05 04:03:52,102 - INFO - Validated that Security group ctest-test_sec_group-54048221 is found in control node 10.0.0.38
2026-10-05 04:03:52,111 - DEBUG - Security group ctest-test_sec_group-54048221 ACLs found in the control node 10.0.0.38
2026-10-05 04:03:52,119 - INFO - Validated that Security group ctest-test_sec_group-54048221 is found in control node 10.0.0.190
2026-10-05 04:03:52,129 - DEBUG - Security group ctest-test_sec_group-54048221 ACLs found in the control node 10.0.0.190
2026-10-05 04:03:52,129 - INFO - Validated SG ctest-test_sec_group-54048221 in Control nodes
2026-10-05 04:03:52,129 - INFO - Deleting Security group: ['default-domain', 'ctest-SecurityGroupBasicRegressionTests1-37697791', 'ctest-test_sec_group-54048221']
2026-10-05 04:03:52,218 - INFO - Security group: ['default-domain', 'ctest-SecurityGroupBasicRegressionTests1-37697791', 'ctest-test_sec_group-54048221'] deleted successfully.
2026-10-05 04:03:52,218 - DEBUG - Requesting: http://10.0.0.177:8082/domains
2026-10-05 04:03:52,230 - DEBUG - Requesting: http://10.0.0.177:8082/domain/6850e378-7089-4036-8f54-55c0ed1b9054
2026-10-05 04:03:52,244 - DEBUG - Requesting: http://10.0.0.177:8082/project/c6b61d79-85a5-455a-b313-7787be66bec9
2026-10-05 04:03:52,370 - INFO - Security group ctest-test_sec_group-54048221 removed from the API Server
2026-10-05 04:03:52,370 - DEBUG - Requesting: http://10.0.0.177:8082/domains
2026-10-05 04:03:52,378 - DEBUG - Requesting: http://10.0.0.177:8082/domain/6850e378-7089-4036-8f54-55c0ed1b9054
2026-10-05 04:03:52,391 - DEBUG - Requesting: http://10.0.0.177:8082/project/c6b61d79-85a5-455a-b313-7787be66bec9
2026-10-05 04:03:52,501 - DEBUG - Requesting: http://10.0.0.177:8082/access-control-lists
2026-10-05 04:03:52,511 - DEBUG - ACLs for Security group ctest-test_sec_group-54048221 removed from the API Server
2026-10-05 04:03:52,516 - INFO - security group ctest-test_sec_group-54048221 removed from Control-node 10.0.0.177
2026-10-05 04:03:52,522 - DEBUG - Security group ctest-test_sec_group-54048221 ACLs removed from the control node 10.0.0.177
2026-10-05 04:03:52,527 - INFO - security group ctest-test_sec_group-54048221 removed from Control-node 10.0.0.38
2026-10-05 04:03:52,533 - DEBUG - Security group ctest-test_sec_group-54048221 ACLs removed from the control node 10.0.0.38
2026-10-05 04:03:52,540 - INFO - security group ctest-test_sec_group-54048221 removed from Control-node 10.0.0.190
2026-10-05 04:03:52,547 - DEBUG - Security group ctest-test_sec_group-54048221 ACLs removed from the control node 10.0.0.190
2026-10-05 04:03:52,547 - INFO - Validated that SG ctest-test_sec_group-54048221 is not in control nodes
2026-10-05 04:03:52,555 - INFO - Creating Security group: ['default-domain', 'ctest-SecurityGroupBasicRegressionTests1-37697791', 'ctest-test_sec_group-54048221']
2026-10-05 04:03:53,787 - DEBUG - Security group: ['default-domain', 'ctest-SecurityGroupBasicRegressionTests1-37697791', 'ctest-test_sec_group-54048221'] created succesfully
2026-10-05 04:03:53,788 - DEBUG - Requesting: http://10.0.0.177:8082/domains
2026-10-05 04:03:53,815 - DEBUG - Requesting: http://10.0.0.177:8082/domain/6850e378-7089-4036-8f54-55c0ed1b9054
2026-10-05 04:03:53,832 - DEBUG - Requesting: http://10.0.0.177:8082/project/c6b61d79-85a5-455a-b313-7787be66bec9
2026-10-05 04:03:53,933 - DEBUG - Requesting: http://10.0.0.177:8082/security-group/8af465ee-74f3-4555-b34e-3df10b1cee82
2026-10-05 04:03:53,948 - INFO - Security group ctest-test_sec_group-54048221 found in the API Server
2026-10-05 04:03:53,948 - DEBUG - Requesting: http://10.0.0.177:8082/domains
2026-10-05 04:03:53,957 - DEBUG - Requesting: http://10.0.0.177:8082/domain/6850e378-7089-4036-8f54-55c0ed1b9054
2026-10-05 04:03:53,971 - DEBUG - Requesting: http://10.0.0.177:8082/project/c6b61d79-85a5-455a-b313-7787be66bec9
2026-10-05 04:03:54,066 - DEBUG - Requesting: http://10.0.0.177:8082/access-control-lists
2026-10-05 04:03:54,077 - INFO - Validated that ACLs for Security group ctest-test_sec_group-54048221 are present in API Server
2026-10-05 04:03:54,085 - INFO - Validated that Security group ctest-test_sec_group-54048221 is found in control node 10.0.0.177
2026-10-05 04:03:54,091 - DEBUG - Security group ctest-test_sec_group-54048221 ACLs found in the control node 10.0.0.177
2026-10-05 04:03:54,098 - INFO - Validated that Security group ctest-test_sec_group-54048221 is found in control node 10.0.0.38
2026-10-05 04:03:54,105 - DEBUG - Security group ctest-test_sec_group-54048221 ACLs found in the control node 10.0.0.38
2026-10-05 04:03:54,115 - INFO - Validated that Security group ctest-test_sec_group-54048221 is found in control node 10.0.0.190
2026-10-05 04:03:54,123 - DEBUG - Security group ctest-test_sec_group-54048221 ACLs found in the control node 10.0.0.190
2026-10-05 04:03:54,123 - INFO - Validated SG ctest-test_sec_group-54048221 in Control nodes
2026-10-05 04:03:54,123 - DEBUG - Replace all the rules of this security group ctest-test_sec_group-54048221 with the new rules
2026-10-05 04:03:54,123 - DEBUG - [{'protocol': 'tcp', 'dst_addresses': [{'subnet': {'ip_prefix': '44.240.28.64', 'ip_prefix_len': '26'}}], 'dst_ports': [{'start_port': 0, 'end_port': -1}], 'src_ports': [{'start_port': 0, 'end_port': -1}], 'src_addresses': [{'security_group': 'local'}]}, {'protocol': 'tcp', 'src_addresses': [{'subnet': {'ip_prefix': '44.240.28.64', 'ip_prefix_len': '26'}}], 'dst_ports': [{'start_port': 0, 'end_port': -1}], 'src_ports': [{'start_port': 0, 'end_port': -1}], 'dst_addresses': [{'security_group': 'local'}]}]
2026-10-05 04:03:55,085 - DEBUG - Response for create_network : {'network': {'id': 'cc067feb-d2a6-4ded-a520-19356d751a48', 'name': 'ctest-SecurityGroupBasicRegressionTests1-37697791-42364115', 'tenant_id': 'c6b61d7985a5455ab3137787be66bec9', 'project_id': 'c6b61d7985a5455ab3137787be66bec9', 'admin_state_up': True, 'shared': False, 'status': 'ACTIVE', 'router:external': False, 'mtu': 0, 'tags': [], 'subnets': [], 'fq_name': ['default-domain', 'ctest-SecurityGroupBasicRegressionTests1-37697791', 'ctest-SecurityGroupBasicRegressionTests1-37697791-42364115'], 'port_security_enabled': True, 'description': ''}}
2026-10-05 04:03:55,386 - DEBUG - Response for create_subnet : {'subnet': {'id': 'a84e94e0-877f-43e1-87ad-ddfe21c092e7', 'name': '', 'tenant_id': 'c6b61d7985a5455ab3137787be66bec9', 'network_id': 'cc067feb-d2a6-4ded-a520-19356d751a48', 'ip_version': 4, 'cidr': '44.240.28.64/26', 'allocation_pools': [{'start': '44.240.28.66', 'end': '44.240.28.126'}], 'gateway_ip': '44.240.28.65', 'enable_dhcp': True, 'ipv6_ra_mode': None, 'ipv6_address_mode': None, 'dns_nameservers': [], 'host_routes': [], 'dns_server_address': '44.240.28.66', 'tags': [], 'project_id': 'c6b61d7985a5455ab3137787be66bec9'}}
2026-10-05 04:03:55,411 - INFO - Created VN ctest-SecurityGroupBasicRegressionTests1-37697791-42364115
2026-10-05 04:03:55,424 - DEBUG - VN ctest-SecurityGroupBasicRegressionTests1-37697791-42364115 UUID is cc067feb-d2a6-4ded-a520-19356d751a48
2026-10-05 04:03:55,512 - DEBUG - Requesting: http://10.0.0.177:8082/domains
2026-10-05 04:03:55,522 - DEBUG - Requesting: http://10.0.0.177:8082/domain/6850e378-7089-4036-8f54-55c0ed1b9054
2026-10-05 04:03:55,536 - DEBUG - Requesting: http://10.0.0.177:8082/project/c6b61d79-85a5-455a-b313-7787be66bec9
2026-10-05 04:03:55,638 - DEBUG - Requesting: http://10.0.0.177:8082/virtual-network/cc067feb-d2a6-4ded-a520-19356d751a48
2026-10-05 04:03:55,652 - DEBUG - Requesting: http://10.0.0.177:8082/virtual-network/cc067feb-d2a6-4ded-a520-19356d751a48
2026-10-05 04:03:55,663 - DEBUG - Requesting: http://10.0.0.177:8082/routing-instance/7924a10c-86d1-40bf-8a03-99d86ea107a6
2026-10-05 04:03:55,674 - DEBUG - Requesting: http://10.0.0.177:8082/routing-instance/7924a10c-86d1-40bf-8a03-99d86ea107a6
2026-10-05 04:03:55,684 - DEBUG - Requesting: http://10.0.0.177:8082/route-target/decc359c-98bd-4888-b8ba-0e6f27a56eea
2026-10-05 04:03:55,693 - DEBUG - Route Targets: ['target:64512:8000010']
2026-10-05 04:03:55,693 - DEBUG - Requesting: http://10.0.0.177:8082/virtual-network/cc067feb-d2a6-4ded-a520-19356d751a48
2026-10-05 04:03:55,704 - DEBUG - Requesting: http://10.0.0.177:8082/routing-instance/7924a10c-86d1-40bf-8a03-99d86ea107a6
2026-10-05 04:03:55,724 - INFO - Verified VN network id 19 for VN cc067feb-d2a6-4ded-a520-19356d751a48
2026-10-05 04:03:55,724 - INFO - Verifications in API Server for VN ctest-SecurityGroupBasicRegressionTests1-37697791-42364115 passed
2026-10-05 04:03:55,725 - DEBUG - Requesting: http://10.0.0.177:8082/virtual-network/cc067feb-d2a6-4ded-a520-19356d751a48
2026-10-05 04:03:55,738 - DEBUG - Requesting: http://10.0.0.177:8082/routing-instance/7924a10c-86d1-40bf-8a03-99d86ea107a6
2026-10-05 04:03:55,749 - DEBUG - Requesting: http://10.0.0.177:8082/routing-instance/7924a10c-86d1-40bf-8a03-99d86ea107a6
2026-10-05 04:03:55,759 - DEBUG - Requesting: http://10.0.0.177:8082/route-target/decc359c-98bd-4888-b8ba-0e6f27a56eea
2026-10-05 04:03:55,776 - DEBUG - Control-node 10.0.0.177 : VN object is : {'node_name': 'virtual-network:default-domain:ctest-SecurityGroupBasicRegressionTests1-37697791:ctest-SecurityGroupBasicRegressionTests1-37697791-42364115', 'interests': '-', 'advertised': '-', 'dbentryflags': None, 'obj_info': {'sequence_number': '0', 'origin': 'Cassandra', 'data': {'id-perms': {'permissions': {'owner': 'ctest-SecurityGroupBasicRegressionTests1-37697791', 'owner-access': '7', 'group': 'reader', 'group-access': '7', 'other-access': '7'}, 'uuid': {'uuid-mslong': '14701578684425719277', 'uuid-lslong': '11898537932773202504'}, 'enable': 'true', 'created': '2026-10-05T04:03:55', 'last-modified': '2026-10-05T04:03:55', 'description': None, 'user-visible': 'true', 'creator': None}}}, 'neighbors': None, 'last_modified': '00:00:00.457493'}
2026-10-05 04:03:55,784 - DEBUG - Route Targets: ['target:64512:8000010']
2026-10-05 04:03:55,791 - DEBUG - Control-node 10.0.0.38 : VN object is : {'node_name': 'virtual-network:default-domain:ctest-SecurityGroupBasicRegressionTests1-37697791:ctest-SecurityGroupBasicRegressionTests1-37697791-42364115', 'interests': '-', 'advertised': '-', 'dbentryflags': None, 'obj_info': {'sequence_number': '0', 'origin': 'Cassandra', 'data': {'id-perms': {'permissions': {'owner': 'ctest-SecurityGroupBasicRegressionTests1-37697791', 'owner-access': '7', 'group': 'reader', 'group-access': '7', 'other-access': '7'}, 'uuid': {'uuid-mslong': '14701578684425719277', 'uuid-lslong': '11898537932773202504'}, 'enable': 'true', 'created': '2026-10-05T04:03:55', 'last-modified': '2026-10-05T04:03:55', 'description': None, 'user-visible': 'true', 'creator': None}}}, 'neighbors': None, 'last_modified': '00:00:00.470153'}
2026-10-05 04:03:55,799 - DEBUG - Route Targets: ['target:64512:8000010']
2026-10-05 04:03:55,806 - DEBUG - Control-node 10.0.0.190 : VN object is : {'node_name': 'virtual-network:default-domain:ctest-SecurityGroupBasicRegressionTests1-37697791:ctest-SecurityGroupBasicRegressionTests1-37697791-42364115', 'interests': '-', 'advertised': '-', 'dbentryflags': None, 'obj_info': {'sequence_number': '0', 'origin': 'Cassandra', 'data': {'id-perms': {'permissions': {'owner': 'ctest-SecurityGroupBasicRegressionTests1-37697791', 'owner-access': '7', 'group': 'reader', 'group-access': '7', 'other-access': '7'}, 'uuid': {'uuid-mslong': '14701578684425719277', 'uuid-lslong': '11898537932773202504'}, 'enable': 'true', 'created': '2026-10-05T04:03:55', 'last-modified': '2026-10-05T04:03:55', 'description': None, 'user-visible': 'true', 'creator': None}}}, 'neighbors': None, 'last_modified': '00:00:00.488361'}
2026-10-05 04:03:55,815 - DEBUG - Route Targets: ['target:64512:8000010']
2026-10-05 04:03:55,815 - INFO - On all control nodes, Config, RI and RT verification for VN ctest-SecurityGroupBasicRegressionTests1-37697791-42364115 passed
2026-10-05 04:03:55,815 - DEBUG - ====Verifying policy data for ctest-SecurityGroupBasicRegressionTests1-37697791-42364115 in API_Server ======
2026-10-05 04:03:55,816 - DEBUG - Requesting: http://10.0.0.177:8082/domains
2026-10-05 04:03:55,824 - DEBUG - Requesting: http://10.0.0.177:8082/domain/6850e378-7089-4036-8f54-55c0ed1b9054
2026-10-05 04:03:55,840 - DEBUG - Requesting: http://10.0.0.177:8082/project/c6b61d79-85a5-455a-b313-7787be66bec9
2026-10-05 04:03:55,947 - DEBUG - Requesting: http://10.0.0.177:8082/virtual-network/cc067feb-d2a6-4ded-a520-19356d751a48
2026-10-05 04:03:55,959 - DEBUG - =>VN ctest-SecurityGroupBasicRegressionTests1-37697791-42364115 has no policy to be verified
2026-10-05 04:03:55,959 - DEBUG - Verifying the vn in opserver
2026-10-05 04:03:55,959 - DEBUG - Verifying the default-domain:ctest-SecurityGroupBasicRegressionTests1-37697791:ctest-SecurityGroupBasicRegressionTests1-37697791-42364115 virtual network link through opserver 10.0.0.177
2026-10-05 04:03:55,959 - DEBUG - Requesting: http://10.0.0.177:8081/analytics/uves/virtual-networks
2026-10-05 04:03:56,342 - DEBUG - Requesting: http://10.0.0.177:8081/analytics/uves/virtual-networks
2026-10-05 04:03:56,415 - DEBUG - vn link and name as {'name': 'default-domain:ctest-SecurityGroupBasicRegressionTests1-37697791:ctest-SecurityGroupBasicRegressionTests1-37697791-42364115', 'href': 'http://10.0.0.177:8081/analytics/uves/virtual-network/default-domain:ctest-SecurityGroupBasicRegressionTests1-37697791:ctest-SecurityGroupBasicRegressionTests1-37697791-42364115?flat'}
2026-10-05 04:03:56,415 - DEBUG - Verifying the default-domain:ctest-SecurityGroupBasicRegressionTests1-37697791:ctest-SecurityGroupBasicRegressionTests1-37697791-42364115 virtual network link through opserver 10.0.0.38
2026-10-05 04:03:56,416 - DEBUG - Requesting: http://10.0.0.38:8081/analytics/uves/virtual-networks
2026-10-05 04:03:56,805 - DEBUG - Requesting: http://10.0.0.38:8081/analytics/uves/virtual-networks
2026-10-05 04:03:56,874 - DEBUG - vn link and name as {'name': 'default-domain:ctest-SecurityGroupBasicRegressionTests1-37697791:ctest-SecurityGroupBasicRegressionTests1-37697791-42364115', 'href': 'http://10.0.0.38:8081/analytics/uves/virtual-network/default-domain:ctest-SecurityGroupBasicRegressionTests1-37697791:ctest-SecurityGroupBasicRegressionTests1-37697791-42364115?flat'}
2026-10-05 04:03:56,874 - DEBUG - Verifying the default-domain:ctest-SecurityGroupBasicRegressionTests1-37697791:ctest-SecurityGroupBasicRegressionTests1-37697791-42364115 virtual network link through opserver 10.0.0.190
2026-10-05 04:03:56,874 - DEBUG - Requesting: http://10.0.0.190:8081/analytics/uves/virtual-networks
2026-10-05 04:03:57,304 - DEBUG - Requesting: http://10.0.0.190:8081/analytics/uves/virtual-networks
2026-10-05 04:03:57,380 - DEBUG - vn link and name as {'name': 'default-domain:ctest-SecurityGroupBasicRegressionTests1-37697791:ctest-SecurityGroupBasicRegressionTests1-37697791-42364115', 'href': 'http://10.0.0.190:8081/analytics/uves/virtual-network/default-domain:ctest-SecurityGroupBasicRegressionTests1-37697791:ctest-SecurityGroupBasicRegressionTests1-37697791-42364115?flat'}
2026-10-05 04:03:57,380 - INFO - Validated that VN default-domain:ctest-SecurityGroupBasicRegressionTests1-37697791:ctest-SecurityGroupBasicRegressionTests1-37697791-42364115 is found in opserver
2026-10-05 04:03:57,406 - DEBUG - Do not have enough data to verify VN in agent
2026-10-05 04:03:57,417 - DEBUG - VRF ids for VN ctest-SecurityGroupBasicRegressionTests1-37697791-42364115: {}
2026-10-05 04:03:57,577 - DEBUG - Services list from nova: [, , , ]
2026-10-05 04:03:58,296 - INFO - VM ([]) created on node: (an-jenkins-deploy-platform-ansible-os-6343-1), Zone: (nova:an-jenkins-deploy-platform-ansible-os-6343-1)
2026-10-05 04:03:59,002 - INFO - VM ([]) created on node: (an-jenkins-deploy-platform-ansible-os-6343-2), Zone: (nova:an-jenkins-deploy-platform-ansible-os-6343-2)
2026-10-05 04:03:59,063 - DEBUG - VM is still in BUILD state, Expected: ACTIVE
2026-10-05 04:04:04,170 - DEBUG - VM is still in BUILD state, Expected: ACTIVE
2026-10-05 04:04:09,284 - DEBUG - VM is still in BUILD state, Expected: ACTIVE
2026-10-05 04:04:14,425 - DEBUG - VM is still in BUILD state, Expected: ACTIVE
2026-10-05 04:04:19,522 - DEBUG - VM is still in BUILD state, Expected: ACTIVE
2026-10-05 04:04:24,632 - DEBUG - VM is in ACTIVE state now
2026-10-05 04:04:24,632 - INFO - VM name : ctest-SecurityGroupBasicRegressionTests1-37697791-18845956
2026-10-05 04:04:24,741 - DEBUG - VM ctest-SecurityGroupBasicRegressionTests1-37697791-18845956 ID is 7c31ff59-2b65-4dbe-95e3-9524e30f1f74
2026-10-05 04:04:24,856 - DEBUG - VM is in ACTIVE state now
2026-10-05 04:04:24,892 - DEBUG - VM ctest-SecurityGroupBasicRegressionTests1-37697791-18845956 launched on Node an-jenkins-deploy-platform-ansible-os-6343-1
2026-10-05 04:04:25,001 - DEBUG - Requesting: http://10.0.0.190:8082/virtual-machine/7c31ff59-2b65-4dbe-95e3-9524e30f1f74
2026-10-05 04:04:25,404 - DEBUG - Requesting: http://10.0.0.190:8082/virtual-machine/7c31ff59-2b65-4dbe-95e3-9524e30f1f74
2026-10-05 04:04:25,449 - DEBUG - Requesting: http://10.0.0.190:8082/virtual-machine/7c31ff59-2b65-4dbe-95e3-9524e30f1f74
2026-10-05 04:04:25,459 - DEBUG - Requesting: http://10.0.0.190:8082/virtual-machine-interface/c5f71613-d690-4ea8-99e6-94eb11187f5a
2026-10-05 04:04:25,477 - DEBUG - Requesting: http://10.0.0.190:8082/virtual-machine/7c31ff59-2b65-4dbe-95e3-9524e30f1f74
2026-10-05 04:04:25,486 - DEBUG - Requesting: http://10.0.0.190:8082/virtual-machine-interface/c5f71613-d690-4ea8-99e6-94eb11187f5a
2026-10-05 04:04:25,500 - DEBUG - Requesting: http://10.0.0.190:8082/instance-ip/43936b78-d81e-4c9b-87d1-3ec83a8dd477
2026-10-05 04:04:25,515 - DEBUG - Verifying in api server 10.0.0.190
2026-10-05 04:04:25,515 - DEBUG - Requesting: http://10.0.0.190:8082/virtual-machine/7c31ff59-2b65-4dbe-95e3-9524e30f1f74
2026-10-05 04:04:25,524 - DEBUG - Requesting: http://10.0.0.190:8082/virtual-machine-interface/c5f71613-d690-4ea8-99e6-94eb11187f5a
2026-10-05 04:04:25,536 - DEBUG - Requesting: http://10.0.0.190:8082/instance-ip/43936b78-d81e-4c9b-87d1-3ec83a8dd477
2026-10-05 04:04:25,546 - INFO - VM ctest-SecurityGroupBasicRegressionTests1-37697791-18845956 verfication in all API Servers passed
2026-10-05 04:04:25,568 - DEBUG - VM ctest-SecurityGroupBasicRegressionTests1-37697791-18845956 Tap interface: {'index': '3', 'name': 'tapc5f71613-d6', 'uuid': 'c5f71613-d690-4ea8-99e6-94eb11187f5a', 'vrf_name': 'default-domain:ctest-SecurityGroupBasicRegressionTests1-37697791:ctest-SecurityGroupBasicRegressionTests1-37697791-42364115:ctest-SecurityGroupBasicRegressionTests1-37697791-42364115', 'active': 'Active', 'ipv4_active': 'Active', 'l2_active': 'L2 Active', 'ip6_active': 'Ipv6 Inactive < no-ipv6-addr >', 'health_check_active': 'Active', 'dhcp_service': 'Enable', 'dhcp_service_v6': 'Disable', 'dns_service': 'Enable', 'type': 'vport', 'label': '25', 'l2_label': '29', 'vxlan_id': '19', 'vn_name': 'default-domain:ctest-SecurityGroupBasicRegressionTests1-37697791:ctest-SecurityGroupBasicRegressionTests1-37697791-42364115', 'vm_uuid': '7c31ff59-2b65-4dbe-95e3-9524e30f1f74', 'vm_name': 'ctest-SecurityGroupBasicRegressionTests1-37697791-18845956', 'ip_addr': '44.240.28.67', 'mac_addr': '02:c5:f7:16:13:d6', 'policy': 'Enable', 'fip_list': [], 'mdata_ip_addr': '169.254.0.3', 'service_vlan_list': None, 'os_ifindex': '62', 'fabric_port': 'NotFabricPort', 'alloc_linklocal_ip': 'LL-Enable', 'analyzer_name': None, 'config_name': 'default-domain:ctest-SecurityGroupBasicRegressionTests1-37697791:c5f71613-d690-4ea8-99e6-94eb11187f5a', 'sg_uuid_list': ['8af465ee-74f3-4555-b34e-3df10b1cee82'], 'static_route_list': None, 'vm_project_uuid': 'c6b61d79-85a5-455a-b313-7787be66bec9', 'admin_state': 'Enabled', 'flow_key_idx': '31', 'allowed_address_pair_list': None, 'ip6_addr': '::', 'local_preference': '0', 'tx_vlan_id': '-1', 'rx_vlan_id': '-1', 'parent_interface': None, 'subnet': '--NA--', 'sub_type': 'Tap', 'vrf_assign_acl_uuid': '--NA--', 'vmi_type': 'Virtual Machine', 'transport': 'Ethernet', 'logical_interface_uuid': '00000000-0000-0000-0000-000000000000', 'flood_unknown_unicast': 'false', 'physical_device': None, 'physical_interface': None, 'fixed_ip4_list': None, 'fixed_ip6_list': None, 'fat_flow_list': None, 'metadata_ip_active': 'Active', 'service_health_check_ip': '0.0.0.0', 'alias_ip_list': None, 'drop_new_flows': 'false', 'bridge_domain_list': [], 'vmi_tag_list': None, 'policy_set_acl_list': None, 'slo_list': None, 'vhostuser_mode': '0', 'si_other_end_vmi': '00000000-0000-0000-0000-000000000000', 'cfg_igmp_enable': 'false', 'igmp_enabled': 'false', 'max_flows': '0', 'policy_set_fwaas_list': None, 'bond_interface_list': None, 'mac_ip_learning_enable': 'false', 'mac_ip_list': []}
2026-10-05 04:04:25,569 - DEBUG - Agent 10.0.0.50 vrf name: default-domain:ctest-SecurityGroupBasicRegressionTests1-37697791:ctest-SecurityGroupBasicRegressionTests1-37697791-42364115:ctest-SecurityGroupBasicRegressionTests1-37697791-42364115
2026-10-05 04:04:25,584 - DEBUG - Agent VRF Object : {'vrf_list': [{'name': 'default-domain:ctest-SecurityGroupBasicRegressionTests1-37697791:ctest-SecurityGroupBasicRegressionTests1-37697791-42364115:ctest-SecurityGroupBasicRegressionTests1-37697791-42364115', 'ucindex': '2', 'mcindex': '2', 'l2index': '2', 'source': 'Config; ', 'uc6index': '2', 'vn': 'default-domain:ctest-SecurityGroupBasicRegressionTests1-37697791:ctest-SecurityGroupBasicRegressionTests1-37697791-42364115', 'table_label': '-1', 'vxlan_id': '19', 'evpnindex': '2', 'brindex': '2', 'mplsindex': '0', 'RD': '10.20.0.193:2', 'mac_aging_time': '0', 'layer2_control_word': 'false', 'forwarding_vrf': None, 'hbf_rintf': '-1', 'hbf_lintf': '-1'}]}
2026-10-05 04:04:25,669 - DEBUG - VM ctest-SecurityGroupBasicRegressionTests1-37697791-18845956 : Tap interface tapc5f71613-d6 is set to Active
2026-10-05 04:04:25,669 - DEBUG - Tap interface tapc5f71613-d6 detail : {'index': '3', 'name': 'tapc5f71613-d6', 'uuid': 'c5f71613-d690-4ea8-99e6-94eb11187f5a', 'vrf_name': 'default-domain:ctest-SecurityGroupBasicRegressionTests1-37697791:ctest-SecurityGroupBasicRegressionTests1-37697791-42364115:ctest-SecurityGroupBasicRegressionTests1-37697791-42364115', 'active': 'Active', 'ipv4_active': 'Active', 'l2_active': 'L2 Active', 'ip6_active': 'Ipv6 Inactive < no-ipv6-addr >', 'health_check_active': 'Active', 'dhcp_service': 'Enable', 'dhcp_service_v6': 'Disable', 'dns_service': 'Enable', 'type': 'vport', 'label': '25', 'l2_label': '29', 'vxlan_id': '19', 'vn_name': 'default-domain:ctest-SecurityGroupBasicRegressionTests1-37697791:ctest-SecurityGroupBasicRegressionTests1-37697791-42364115', 'vm_uuid': '7c31ff59-2b65-4dbe-95e3-9524e30f1f74', 'vm_name': 'ctest-SecurityGroupBasicRegressionTests1-37697791-18845956', 'ip_addr': '44.240.28.67', 'mac_addr': '02:c5:f7:16:13:d6', 'policy': 'Enable', 'fip_list': [], 'mdata_ip_addr': '169.254.0.3', 'service_vlan_list': None, 'os_ifindex': '62', 'fabric_port': 'NotFabricPort', 'alloc_linklocal_ip': 'LL-Enable', 'analyzer_name': None, 'config_name': 'default-domain:ctest-SecurityGroupBasicRegressionTests1-37697791:c5f71613-d690-4ea8-99e6-94eb11187f5a', 'sg_uuid_list': ['8af465ee-74f3-4555-b34e-3df10b1cee82'], 'static_route_list': None, 'vm_project_uuid': 'c6b61d79-85a5-455a-b313-7787be66bec9', 'admin_state': 'Enabled', 'flow_key_idx': '31', 'allowed_address_pair_list': None, 'ip6_addr': '::', 'local_preference': '0', 'tx_vlan_id': '-1', 'rx_vlan_id': '-1', 'parent_interface': None, 'subnet': '--NA--', 'sub_type': 'Tap', 'vrf_assign_acl_uuid': '--NA--', 'vmi_type': 'Virtual Machine', 'transport': 'Ethernet', 'logical_interface_uuid': '00000000-0000-0000-0000-000000000000', 'flood_unknown_unicast': 'false', 'physical_device': None, 'physical_interface': None, 'fixed_ip4_list': None, 'fixed_ip6_list': None, 'fat_flow_list': None, 'metadata_ip_active': 'Active', 'service_health_check_ip': '0.0.0.0', 'alias_ip_list': None, 'drop_new_flows': 'false', 'bridge_domain_list': [], 'vmi_tag_list': None, 'policy_set_acl_list': None, 'slo_list': None, 'vhostuser_mode': '0', 'si_other_end_vmi': '00000000-0000-0000-0000-000000000000', 'cfg_igmp_enable': 'false', 'igmp_enabled': 'false', 'max_flows': '0', 'policy_set_fwaas_list': None, 'bond_interface_list': None, 'mac_ip_learning_enable': 'false', 'mac_ip_list': []}
2026-10-05 04:04:25,789 - DEBUG - Starting Layer 2 verification in Agent
2026-10-05 04:04:25,812 - DEBUG - Layer 2 path is seen for VM MAC 02:c5:f7:16:13:d6 in agent 10.0.0.50
2026-10-05 04:04:25,812 - DEBUG - Active layer 2 route in agent is present for VMI tapc5f71613-d6
2026-10-05 04:04:25,812 - DEBUG - L2 label(29) matches bw route table and interface table
2026-10-05 04:04:25,830 - DEBUG - VN default-domain:ctest-SecurityGroupBasicRegressionTests1-37697791:ctest-SecurityGroupBasicRegressionTests1-37697791-42364115 is found in Agent of node 10.0.0.50
2026-10-05 04:04:25,931 - DEBUG - VRF IDs of VN default-domain:ctest-SecurityGroupBasicRegressionTests1-37697791:ctest-SecurityGroupBasicRegressionTests1-37697791-42364115 is consistent in agent 10.0.0.50
2026-10-05 04:04:25,932 - DEBUG - Route for VM IP ['44.240.28.67'] is consistent in agent 10.0.0.50
2026-10-05 04:04:25,932 - DEBUG - VN default-domain:ctest-SecurityGroupBasicRegressionTests1-37697791:ctest-SecurityGroupBasicRegressionTests1-37697791-42364115 verification for VM ctest-SecurityGroupBasicRegressionTests1-37697791-18845956 in Agent 10.0.0.50 passed
2026-10-05 04:04:26,050 - DEBUG - Starting all layer 2 verification in agent 10.0.0.50
2026-10-05 04:04:26,070 - DEBUG - Route for VM MAC 02:c5:f7:16:13:d6 is consistent in agent 10.0.0.50
2026-10-05 04:04:29,283 - DEBUG - (True, 'PING 169.254.0.3 (169.254.0.3) 56(84) bytes of data.\r\n\r\n--- 169.254.0.3 ping statistics ---\r\n2 packets transmitted, 0 received, 100% packet loss, time 1022ms')
2026-10-05 04:04:29,283 - DEBUG - Ping to Metadata IP 169.254.0.3 of VM ctest-SecurityGroupBasicRegressionTests1-37697791-18845956 failed!
2026-10-05 04:04:29,301 - DEBUG - Gateway for vn default-domain:ctest-SecurityGroupBasicRegressionTests1-37697791:ctest-SecurityGroupBasicRegressionTests1-37697791-42364115 is 44.240.28.65 and allocation pool is NOT set
2026-10-05 04:04:33,374 - DEBUG - (True, 'PING 169.254.0.3 (169.254.0.3) 56(84) bytes of data.\r\n\r\n--- 169.254.0.3 ping statistics ---\r\n2 packets transmitted, 0 received, 100% packet loss, time 1011ms')
2026-10-05 04:04:33,375 - DEBUG - Ping to Metadata IP 169.254.0.3 of VM ctest-SecurityGroupBasicRegressionTests1-37697791-18845956 failed!
2026-10-05 04:04:33,394 - DEBUG - Gateway for vn default-domain:ctest-SecurityGroupBasicRegressionTests1-37697791:ctest-SecurityGroupBasicRegressionTests1-37697791-42364115 is 44.240.28.65 and allocation pool is NOT set
2026-10-05 04:04:37,481 - DEBUG - (True, 'PING 169.254.0.3 (169.254.0.3) 56(84) bytes of data.\r\n\r\n--- 169.254.0.3 ping statistics ---\r\n2 packets transmitted, 0 received, 100% packet loss, time 1014ms')
2026-10-05 04:04:37,481 - DEBUG - Ping to Metadata IP 169.254.0.3 of VM ctest-SecurityGroupBasicRegressionTests1-37697791-18845956 failed!
2026-10-05 04:04:37,498 - DEBUG - Gateway for vn default-domain:ctest-SecurityGroupBasicRegressionTests1-37697791:ctest-SecurityGroupBasicRegressionTests1-37697791-42364115 is 44.240.28.65 and allocation pool is NOT set
2026-10-05 04:04:41,569 - DEBUG - (True, 'PING 169.254.0.3 (169.254.0.3) 56(84) bytes of data.\r\n\r\n--- 169.254.0.3 ping statistics ---\r\n2 packets transmitted, 0 received, 100% packet loss, time 1005ms')
2026-10-05 04:04:41,570 - DEBUG - Ping to Metadata IP 169.254.0.3 of VM ctest-SecurityGroupBasicRegressionTests1-37697791-18845956 failed!
2026-10-05 04:04:41,590 - DEBUG - Gateway for vn default-domain:ctest-SecurityGroupBasicRegressionTests1-37697791:ctest-SecurityGroupBasicRegressionTests1-37697791-42364115 is 44.240.28.65 and allocation pool is NOT set
2026-10-05 04:04:45,667 - DEBUG - (True, 'PING 169.254.0.3 (169.254.0.3) 56(84) bytes of data.\r\n\r\n--- 169.254.0.3 ping statistics ---\r\n2 packets transmitted, 0 received, 100% packet loss, time 1009ms')
2026-10-05 04:04:45,668 - DEBUG - Ping to Metadata IP 169.254.0.3 of VM ctest-SecurityGroupBasicRegressionTests1-37697791-18845956 failed!
2026-10-05 04:04:45,685 - DEBUG - Gateway for vn default-domain:ctest-SecurityGroupBasicRegressionTests1-37697791:ctest-SecurityGroupBasicRegressionTests1-37697791-42364115 is 44.240.28.65 and allocation pool is NOT set
2026-10-05 04:04:49,759 - DEBUG - (True, 'PING 169.254.0.3 (169.254.0.3) 56(84) bytes of data.\r\n\r\n--- 169.254.0.3 ping statistics ---\r\n2 packets transmitted, 0 received, 100% packet loss, time 1007ms')
2026-10-05 04:04:49,759 - DEBUG - Ping to Metadata IP 169.254.0.3 of VM ctest-SecurityGroupBasicRegressionTests1-37697791-18845956 failed!
2026-10-05 04:04:49,775 - DEBUG - Gateway for vn default-domain:ctest-SecurityGroupBasicRegressionTests1-37697791:ctest-SecurityGroupBasicRegressionTests1-37697791-42364115 is 44.240.28.65 and allocation pool is NOT set
2026-10-05 04:04:53,854 - DEBUG - (True, 'PING 169.254.0.3 (169.254.0.3) 56(84) bytes of data.\r\n\r\n--- 169.254.0.3 ping statistics ---\r\n2 packets transmitted, 0 received, 100% packet loss, time 1017ms')
2026-10-05 04:04:53,854 - DEBUG - Ping to Metadata IP 169.254.0.3 of VM ctest-SecurityGroupBasicRegressionTests1-37697791-18845956 failed!
2026-10-05 04:04:53,870 - DEBUG - Gateway for vn default-domain:ctest-SecurityGroupBasicRegressionTests1-37697791:ctest-SecurityGroupBasicRegressionTests1-37697791-42364115 is 44.240.28.65 and allocation pool is NOT set
2026-10-05 04:04:55,940 - DEBUG - (True, 'PING 169.254.0.3 (169.254.0.3) 56(84) bytes of data.\r\n64 bytes from 169.254.0.3: icmp_seq=1 ttl=63 time=9.65 ms\r\n64 bytes from 169.254.0.3: icmp_seq=2 ttl=63 time=0.919 ms\r\n\r\n--- 169.254.0.3 ping statistics ---\r\n2 packets transmitted, 2 received, 0% packet loss, time 1002ms\r\nrtt min/avg/max/mdev = 0.919/5.285/9.651/4.366 ms')
2026-10-05 04:04:55,940 - INFO - Ping to Metadata IP 169.254.0.3 of VM ctest-SecurityGroupBasicRegressionTests1-37697791-18845956 passed
2026-10-05 04:04:55,940 - INFO - VM ctest-SecurityGroupBasicRegressionTests1-37697791-18845956 verifications in Compute nodes passed
2026-10-05 04:04:56,206 - DEBUG - Validated VM route 44.240.28.67 in vrouter of 10.0.0.50
2026-10-05 04:04:56,212 - DEBUG - Remote Nh validation passed. Expected Tunnel, label: None, 0; Got None,0
2026-10-05 04:04:56,212 - INFO - Validated routes of VM ctest-SecurityGroupBasicRegressionTests1-37697791-18845956 in all vrouters
2026-10-05 04:04:56,647 - DEBUG - Starting all layer2 verification in 10.0.0.38 Control Node
2026-10-05 04:04:56,794 - DEBUG - Layer2 route found for VM MAC 02:c5:f7:16:13:d6 in Control-node 10.0.0.38
2026-10-05 04:04:56,795 - DEBUG - L2 Label for VM ctest-SecurityGroupBasicRegressionTests1-37697791-18845956 same between Control-node 10.0.0.38 and Agent, Expected: 29, Seen: 29
2026-10-05 04:04:56,795 - DEBUG - Starting all layer2 verification in 10.0.0.190 Control Node
2026-10-05 04:04:56,923 - DEBUG - Layer2 route found for VM MAC 02:c5:f7:16:13:d6 in Control-node 10.0.0.190
2026-10-05 04:04:56,923 - DEBUG - L2 Label for VM ctest-SecurityGroupBasicRegressionTests1-37697791-18845956 same between Control-node 10.0.0.190 and Agent, Expected: 29, Seen: 29
2026-10-05 04:04:56,923 - INFO - Verification in Control-nodes for VM ctest-SecurityGroupBasicRegressionTests1-37697791-18845956 passed
2026-10-05 04:04:56,923 - DEBUG - Verifying the vm in opserver
2026-10-05 04:04:56,923 - DEBUG - Verifying in collector 10.0.0.190 ...
2026-10-05 04:04:56,923 - DEBUG - Requesting: http://10.0.0.190:8081/analytics/uves/virtual-machine/7c31ff59-2b65-4dbe-95e3-9524e30f1f74?flat
2026-10-05 04:04:56,998 - DEBUG - Requesting: http://10.0.0.177:8081/analytics/uves/virtual-machine-interface/default-domain:ctest-SecurityGroupBasicRegressionTests1-37697791:c5f71613-d690-4ea8-99e6-94eb11187f5a?flat
2026-10-05 04:04:57,084 - DEBUG - Requesting: http://10.0.0.177:8081/analytics/uves/virtual-machine-interface/default-domain:ctest-SecurityGroupBasicRegressionTests1-37697791:c5f71613-d690-4ea8-99e6-94eb11187f5a?flat
2026-10-05 04:04:57,127 - DEBUG - Requesting: http://10.0.0.190:8081/analytics/uves/virtual-machine/7c31ff59-2b65-4dbe-95e3-9524e30f1f74?flat
2026-10-05 04:04:57,210 - DEBUG - Verifying vm in vn uve
2026-10-05 04:04:57,211 - DEBUG - Requesting: http://10.0.0.177:8081/analytics/uves/virtual-machine-interface/default-domain:ctest-SecurityGroupBasicRegressionTests1-37697791:c5f71613-d690-4ea8-99e6-94eb11187f5a?flat
2026-10-05 04:04:57,327 - DEBUG - VM uve shows interface as {'fixed_ip4_list': ['44.240.28.67'], 'ip6_address': '::', 'ip_address': '44.240.28.67', 'label': 25, 'mac_address': '02:c5:f7:16:13:d6', 'port_mirror_enabled': False, 'uuid': 'c5f71613-d690-4ea8-99e6-94eb11187f5a', 'vhostuser_mode': 0, 'gateway': '44.240.28.65', 'ip6_active': False, 'l2_active': True, 'vm_name': 'ctest-SecurityGroupBasicRegressionTests1-37697791-18845956', 'tx_vlan': 65535, 'virtual_network': 'default-domain:ctest-SecurityGroupBasicRegressionTests1-37697791:ctest-SecurityGroupBasicRegressionTests1-37697791-42364115', 'ip4_active': True, '__T': 1791173081238547, 'vm_uuid': '7c31ff59-2b65-4dbe-95e3-9524e30f1f74', 'admin_state': True, 'active': True, 'rx_vlan': 65535, 'is_health_check_active': True, 'vn_uuid': 'cc067feb-d2a6-4ded-a520-19356d751a48'}
2026-10-05 04:04:57,327 - DEBUG - VM uve shows ip address as ['44.240.28.67', '::']
2026-10-05 04:04:57,327 - DEBUG - VM uve shows virtual network as default-domain:ctest-SecurityGroupBasicRegressionTests1-37697791:ctest-SecurityGroupBasicRegressionTests1-37697791-42364115
2026-10-05 04:04:57,327 - INFO - Verifying through opserver in 10.0.0.177
2026-10-05 04:04:57,327 - DEBUG - Requesting: http://10.0.0.177:8081/analytics/uves/virtual-network/default-domain:ctest-SecurityGroupBasicRegressionTests1-37697791:ctest-SecurityGroupBasicRegressionTests1-37697791-42364115?flat
2026-10-05 04:04:57,368 - DEBUG - expected vm list 7c31ff59-2b65-4dbe-95e3-9524e30f1f74
2026-10-05 04:04:57,368 - DEBUG - Extracted vm list ['7c31ff59-2b65-4dbe-95e3-9524e30f1f74']
2026-10-05 04:04:57,368 - INFO - VM 7c31ff59-2b65-4dbe-95e3-9524e30f1f74 is present in default-domain:ctest-SecurityGroupBasicRegressionTests1-37697791:ctest-SecurityGroupBasicRegressionTests1-37697791-42364115
2026-10-05 04:04:57,370 - DEBUG - Verifying vm in vrouter uve
2026-10-05 04:04:57,370 - DEBUG - Getting info from collector 10.0.0.190..
2026-10-05 04:04:57,370 - DEBUG - Requesting: http://10.0.0.190:8081/analytics/uves/virtual-machine/7c31ff59-2b65-4dbe-95e3-9524e30f1f74?flat
2026-10-05 04:04:57,389 - DEBUG - VM uve shows vrouter as ['an-jenkins-deploy-platform-ansible-os-6343-1']
2026-10-05 04:04:57,389 - DEBUG - Requesting: http://10.0.0.177:8081/analytics/uves/generator/an-jenkins-deploy-platform-ansible-os-6343-1:Compute:contrail-vrouter-agent:0?flat
2026-10-05 04:04:57,434 - DEBUG - Requesting: http://10.0.0.38:8081/analytics/uves/vrouter/an-jenkins-deploy-platform-ansible-os-6343-1?flat
2026-10-05 04:04:57,513 - DEBUG - VM 7c31ff59-2b65-4dbe-95e3-9524e30f1f74 is present in vrouter an-jenkins-deploy-platform-ansible-os-6343-1 uve
2026-10-05 04:04:57,514 - DEBUG - Validated that VM ctest-SecurityGroupBasicRegressionTests1-37697791-18845956 is in Vrouter an-jenkins-deploy-platform-ansible-os-6343-1 UVE
2026-10-05 04:04:57,514 - DEBUG - Verifying vm tap interface/vn in vrouter uve
2026-10-05 04:04:57,522 - DEBUG - Expected tap interface of VM uuid 7c31ff59-2b65-4dbe-95e3-9524e30f1f74 is default-domain:ctest-SecurityGroupBasicRegressionTests1-37697791:c5f71613-d690-4ea8-99e6-94eb11187f5a
2026-10-05 04:04:57,522 - DEBUG - Expected VN of VM uuid 7c31ff59-2b65-4dbe-95e3-9524e30f1f74 is default-domain:ctest-SecurityGroupBasicRegressionTests1-37697791:ctest-SecurityGroupBasicRegressionTests1-37697791-42364115
2026-10-05 04:04:57,522 - DEBUG - Requesting: http://10.0.0.177:8081/analytics/uves/generator/an-jenkins-deploy-platform-ansible-os-6343-1:Compute:contrail-vrouter-agent:0?flat
2026-10-05 04:04:57,567 - DEBUG - Requesting: http://10.0.0.38:8081/analytics/uves/vrouter/an-jenkins-deploy-platform-ansible-os-6343-1?flat
2026-10-05 04:04:57,612 - DEBUG - VM 7c31ff59-2b65-4dbe-95e3-9524e30f1f74 is present in vrouter an-jenkins-deploy-platform-ansible-os-6343-1 uve
2026-10-05 04:04:57,612 - INFO - tap interface default-domain:ctest-SecurityGroupBasicRegressionTests1-37697791:c5f71613-d690-4ea8-99e6-94eb11187f5a of vm 7c31ff59-2b65-4dbe-95e3-9524e30f1f74 is present in vrouter an-jenkins-deploy-platform-ansible-os-6343-1 uve
2026-10-05 04:04:57,612 - DEBUG - Connected network default-domain:ctest-SecurityGroupBasicRegressionTests1-37697791:ctest-SecurityGroupBasicRegressionTests1-37697791-42364115 of vm 7c31ff59-2b65-4dbe-95e3-9524e30f1f74 is present in vrouter an-jenkins-deploy-platform-ansible-os-6343-1 uve
2026-10-05 04:04:57,612 - DEBUG - Verifying the 7c31ff59-2b65-4dbe-95e3-9524e30f1f74 virtual network link through opserver 10.0.0.177
2026-10-05 04:04:57,612 - DEBUG - Requesting: http://10.0.0.177:8081/analytics/uves/virtual-machines
2026-10-05 04:04:57,627 - DEBUG - VM link and name as {'name': '7c31ff59-2b65-4dbe-95e3-9524e30f1f74', 'href': 'http://10.0.0.177:8081/analytics/uves/virtual-machine/7c31ff59-2b65-4dbe-95e3-9524e30f1f74?flat'}
2026-10-05 04:04:57,627 - DEBUG - Verifying the 7c31ff59-2b65-4dbe-95e3-9524e30f1f74 virtual network link through opserver 10.0.0.38
2026-10-05 04:04:57,627 - DEBUG - Requesting: http://10.0.0.38:8081/analytics/uves/virtual-machines
2026-10-05 04:04:57,681 - DEBUG - VM link and name as {'name': '7c31ff59-2b65-4dbe-95e3-9524e30f1f74', 'href': 'http://10.0.0.38:8081/analytics/uves/virtual-machine/7c31ff59-2b65-4dbe-95e3-9524e30f1f74?flat'}
2026-10-05 04:04:57,681 - DEBUG - Verifying the 7c31ff59-2b65-4dbe-95e3-9524e30f1f74 virtual network link through opserver 10.0.0.190
2026-10-05 04:04:57,681 - DEBUG - Requesting: http://10.0.0.190:8081/analytics/uves/virtual-machines
2026-10-05 04:04:57,695 - DEBUG - VM link and name as {'name': '7c31ff59-2b65-4dbe-95e3-9524e30f1f74', 'href': 'http://10.0.0.190:8081/analytics/uves/virtual-machine/7c31ff59-2b65-4dbe-95e3-9524e30f1f74?flat'}
2026-10-05 04:04:57,695 - INFO - VM ctest-SecurityGroupBasicRegressionTests1-37697791-18845956 validations in Opserver passed
2026-10-05 04:04:57,695 - INFO - Waiting for VM ctest-SecurityGroupBasicRegressionTests1-37697791-18845956 to be up..
2026-10-05 04:04:57,696 - DEBUG - verify_vm_launched is skipped since self.vm_launch_flag is set
2026-10-05 04:04:57,696 - DEBUG - Requesting: http://10.0.0.190:8082/virtual-machine/7c31ff59-2b65-4dbe-95e3-9524e30f1f74
2026-10-05 04:04:57,706 - DEBUG - Requesting: http://10.0.0.190:8082/virtual-machine-interface/c5f71613-d690-4ea8-99e6-94eb11187f5a
2026-10-05 04:04:58,881 - DEBUG - (True, 'PING 169.254.0.3 (169.254.0.3) 56(84) bytes of data.\r\n64 bytes from 169.254.0.3: icmp_seq=1 ttl=63 time=2.65 ms\r\n64 bytes from 169.254.0.3: icmp_seq=2 ttl=63 time=0.411 ms\r\n\r\n--- 169.254.0.3 ping statistics ---\r\n2 packets transmitted, 2 received, 0% packet loss, time 1001ms\r\nrtt min/avg/max/mdev = 0.411/1.529/2.648/1.118 ms')
2026-10-05 04:04:58,881 - INFO - Ping to Metadata IP 169.254.0.3 of VM ctest-SecurityGroupBasicRegressionTests1-37697791-18845956 passed
2026-10-05 04:04:58,957 - DEBUG - verify_vm_launched is skipped since self.vm_launch_flag is set
2026-10-05 04:04:58,957 - DEBUG - Waiting to SSH to VM ctest-SecurityGroupBasicRegressionTests1-37697791-18845956, IP 44.240.28.67, Port 22
2026-10-05 04:04:59,025 - DEBUG - Error on ssh to ubuntu@169.254.0.3:22, result: /bin/bash: connect: Connection refused
/bin/bash: line 1: /dev/tcp/169.254.0.3/22: Connection refused {'failed': True, 'command': '(echo > /dev/tcp/169.254.0.3/22)', 'real_command': '/bin/bash -l -c "(echo > /dev/tcp/169.254.0.3/22)"', 'return_code': 1, 'succeeded': False, 'stderr': ''}
2026-10-05 04:04:59,122 - DEBUG - VM ctest-SecurityGroupBasicRegressionTests1-37697791-18845956 is NOT ready for SSH connections, VM status: ACTIVE
2026-10-05 04:05:04,123 - DEBUG - verify_vm_launched is skipped since self.vm_launch_flag is set
2026-10-05 04:05:04,123 - DEBUG - Waiting to SSH to VM ctest-SecurityGroupBasicRegressionTests1-37697791-18845956, IP 44.240.28.67, Port 22
2026-10-05 04:05:04,196 - DEBUG - Error on ssh to ubuntu@169.254.0.3:22, result: /bin/bash: connect: Connection refused
/bin/bash: line 1: /dev/tcp/169.254.0.3/22: Connection refused {'failed': True, 'command': '(echo > /dev/tcp/169.254.0.3/22)', 'real_command': '/bin/bash -l -c "(echo > /dev/tcp/169.254.0.3/22)"', 'return_code': 1, 'succeeded': False, 'stderr': ''}
2026-10-05 04:05:04,293 - DEBUG - VM ctest-SecurityGroupBasicRegressionTests1-37697791-18845956 is NOT ready for SSH connections, VM status: ACTIVE
2026-10-05 04:05:09,294 - DEBUG - verify_vm_launched is skipped since self.vm_launch_flag is set
2026-10-05 04:05:09,294 - DEBUG - Waiting to SSH to VM ctest-SecurityGroupBasicRegressionTests1-37697791-18845956, IP 44.240.28.67, Port 22
2026-10-05 04:05:09,478 - DEBUG - VM ctest-SecurityGroupBasicRegressionTests1-37697791-18845956 is ready for SSH connections
2026-10-05 04:05:09,539 - DEBUG - VM is still in BUILD state, Expected: ACTIVE
2026-10-05 04:05:14,592 - DEBUG - VM is still in BUILD state, Expected: ACTIVE
2026-10-05 04:05:19,654 - DEBUG - VM is still in BUILD state, Expected: ACTIVE
2026-10-05 04:05:24,734 - DEBUG - VM is still in BUILD state, Expected: ACTIVE
2026-10-05 04:05:29,802 - DEBUG - VM is still in BUILD state, Expected: ACTIVE
2026-10-05 04:05:34,860 - DEBUG - VM is still in BUILD state, Expected: ACTIVE
2026-10-05 04:05:39,920 - DEBUG - VM is still in BUILD state, Expected: ACTIVE
2026-10-05 04:05:44,979 - DEBUG - VM is still in BUILD state, Expected: ACTIVE
2026-10-05 04:05:50,051 - DEBUG - VM is still in BUILD state, Expected: ACTIVE
2026-10-05 04:05:55,115 - DEBUG - VM is still in BUILD state, Expected: ACTIVE
2026-10-05 04:06:00,175 - DEBUG - VM is still in BUILD state, Expected: ACTIVE
2026-10-05 04:06:05,243 - DEBUG - VM is still in BUILD state, Expected: ACTIVE
2026-10-05 04:06:10,342 - DEBUG - VM is still in BUILD state, Expected: ACTIVE
2026-10-05 04:06:15,398 - DEBUG - VM is still in BUILD state, Expected: ACTIVE
2026-10-05 04:06:20,455 - DEBUG - VM is still in BUILD state, Expected: ACTIVE
2026-10-05 04:06:25,512 - DEBUG - VM is still in BUILD state, Expected: ACTIVE
2026-10-05 04:06:30,579 - DEBUG - VM is still in BUILD state, Expected: ACTIVE
2026-10-05 04:06:35,638 - DEBUG - VM is still in BUILD state, Expected: ACTIVE
2026-10-05 04:06:40,696 - DEBUG - VM is still in BUILD state, Expected: ACTIVE
2026-10-05 04:06:45,765 - DEBUG - VM is still in BUILD state, Expected: ACTIVE
2026-10-05 04:06:50,821 - DEBUG - VM is still in BUILD state, Expected: ACTIVE
2026-10-05 04:06:55,878 - DEBUG - VM is still in BUILD state, Expected: ACTIVE
2026-10-05 04:07:00,938 - DEBUG - VM is still in BUILD state, Expected: ACTIVE
2026-10-05 04:07:06,011 - DEBUG - VM is still in BUILD state, Expected: ACTIVE
2026-10-05 04:07:11,092 - DEBUG - VM is still in BUILD state, Expected: ACTIVE
2026-10-05 04:07:16,151 - DEBUG - VM is still in BUILD state, Expected: ACTIVE
2026-10-05 04:07:21,216 - DEBUG - VM is still in BUILD state, Expected: ACTIVE
2026-10-05 04:07:26,282 - DEBUG - VM is still in BUILD state, Expected: ACTIVE
2026-10-05 04:07:31,339 - DEBUG - VM is still in BUILD state, Expected: ACTIVE
2026-10-05 04:07:36,570 - DEBUG - VM is still in BUILD state, Expected: ACTIVE
2026-10-05 04:07:41,633 - DEBUG - VM is still in BUILD state, Expected: ACTIVE
2026-10-05 04:07:41,635 - INFO - Skip interface_detach for VM ctest-SecurityGroupBasicRegressionTests1-37697791-26105840 in state BUILD
2026-10-05 04:07:41,636 - INFO - Removing the security group from VM ctest-SecurityGroupBasicRegressionTests1-37697791-26105840
2026-10-05 04:07:41,716 - DEBUG - Security group 8af465ee-74f3-4555-b34e-3df10b1cee82 not found for VM b3e47f9f-4215-40ea-9b7d-d9d7e06ea59e, skip remove
2026-10-05 04:07:41,716 - INFO - Deleting VM ctest-SecurityGroupBasicRegressionTests1-37697791-26105840
2026-10-05 04:07:41,716 - ERROR - VM ctest-SecurityGroupBasicRegressionTests1-37697791-26105840 has failed to come up
2026-10-05 04:07:41,716 - ERROR - Nova failed to get host of the VM
2026-10-05 04:07:41,717 - ERROR - VM ctest-SecurityGroupBasicRegressionTests1-37697791-26105840 has failed to come up
2026-10-05 04:07:41,717 - ERROR - Nova failed to get host of the VM
2026-10-05 04:07:41,894 - INFO - Removing the security group from VM ctest-SecurityGroupBasicRegressionTests1-37697791-18845956
2026-10-05 04:07:42,168 - INFO - Deleting VM ctest-SecurityGroupBasicRegressionTests1-37697791-18845956
2026-10-05 04:07:42,255 - DEBUG - Verifying in api server 10.0.0.190
2026-10-05 04:07:42,255 - DEBUG - Requesting: http://10.0.0.190:8082/virtual-machine/7c31ff59-2b65-4dbe-95e3-9524e30f1f74
2026-10-05 04:07:42,265 - DEBUG - VM ID 7c31ff59-2b65-4dbe-95e3-9524e30f1f74 of VM ctest-SecurityGroupBasicRegressionTests1-37697791-18845956 is still found in API Server
2026-10-05 04:07:44,266 - DEBUG - Verifying in api server 10.0.0.190
2026-10-05 04:07:44,266 - DEBUG - Requesting: http://10.0.0.190:8082/virtual-machine/7c31ff59-2b65-4dbe-95e3-9524e30f1f74
2026-10-05 04:07:44,275 - DEBUG - VM ID 7c31ff59-2b65-4dbe-95e3-9524e30f1f74 of VM ctest-SecurityGroupBasicRegressionTests1-37697791-18845956 is still found in API Server
2026-10-05 04:07:46,276 - DEBUG - Verifying in api server 10.0.0.190
2026-10-05 04:07:46,276 - DEBUG - Requesting: http://10.0.0.190:8082/virtual-machine/7c31ff59-2b65-4dbe-95e3-9524e30f1f74
2026-10-05 04:07:46,284 - DEBUG - Response Code: 404
2026-10-05 04:07:46,285 - DEBUG - Requesting: http://10.0.0.190:8082/virtual-machine/7c31ff59-2b65-4dbe-95e3-9524e30f1f74
2026-10-05 04:07:46,293 - DEBUG - Response Code: 404
2026-10-05 04:07:46,293 - DEBUG - Requesting: http://10.0.0.190:8082/virtual-machine/7c31ff59-2b65-4dbe-95e3-9524e30f1f74
2026-10-05 04:07:46,301 - DEBUG - Response Code: 404
2026-10-05 04:07:46,301 - INFO - VM ctest-SecurityGroupBasicRegressionTests1-37697791-18845956 is fully removed in API-Server
2026-10-05 04:07:46,464 - DEBUG - Skipping VM-deletion-check in nova db since mysql_token is not found
2026-10-05 04:07:46,515 - DEBUG - Validated that vrouter 10.0.0.50 does not have VMs route for VN default-domain:ctest-SecurityGroupBasicRegressionTests1-37697791:ctest-SecurityGroupBasicRegressionTests1-37697791-42364115
2026-10-05 04:07:46,529 - DEBUG - Validated that vrouter 10.0.0.191 does not have VMs route for VN default-domain:ctest-SecurityGroupBasicRegressionTests1-37697791:ctest-SecurityGroupBasicRegressionTests1-37697791-42364115
2026-10-05 04:07:46,529 - INFO - Validated that all vrouters do not have VMs route for VN default-domain:ctest-SecurityGroupBasicRegressionTests1-37697791:ctest-SecurityGroupBasicRegressionTests1-37697791-42364115
2026-10-05 04:07:46,529 - INFO - VM ctest-SecurityGroupBasicRegressionTests1-37697791-18845956 is removed in Compute, and routes are removed in all compute nodes
2026-10-05 04:07:46,739 - INFO - Routes for VM ctest-SecurityGroupBasicRegressionTests1-37697791-18845956 is removed in all control-nodes
2026-10-05 04:07:46,739 - DEBUG - Requesting: http://10.0.0.177:8081/analytics/uves/generator/an-jenkins-deploy-platform-ansible-os-6343-1:Compute:contrail-vrouter-agent:0?flat
2026-10-05 04:07:46,788 - DEBUG - Requesting: http://10.0.0.38:8081/analytics/uves/vrouter/an-jenkins-deploy-platform-ansible-os-6343-1?flat
2026-10-05 04:07:46,823 - DEBUG - VM 7c31ff59-2b65-4dbe-95e3-9524e30f1f74 is still present in vrouter an-jenkins-deploy-platform-ansible-os-6343-1 uve
2026-10-05 04:07:46,824 - DEBUG - Verifying if the vm interface deleted from vroter uve...
2026-10-05 04:07:46,824 - DEBUG - interface for vm 7c31ff59-2b65-4dbe-95e3-9524e30f1f74 deleted from vrouter uve ...
2026-10-05 04:07:46,824 - DEBUG - Deleted interface not in error interface list ...
2026-10-05 04:07:49,825 - DEBUG - Requesting: http://10.0.0.177:8081/analytics/uves/generator/an-jenkins-deploy-platform-ansible-os-6343-1:Compute:contrail-vrouter-agent:0?flat
2026-10-05 04:07:49,872 - DEBUG - Requesting: http://10.0.0.38:8081/analytics/uves/vrouter/an-jenkins-deploy-platform-ansible-os-6343-1?flat
2026-10-05 04:07:49,907 - DEBUG - VM 7c31ff59-2b65-4dbe-95e3-9524e30f1f74 is still present in vrouter an-jenkins-deploy-platform-ansible-os-6343-1 uve
2026-10-05 04:07:49,907 - DEBUG - Verifying if the vm interface deleted from vroter uve...
2026-10-05 04:07:49,907 - DEBUG - interface for vm 7c31ff59-2b65-4dbe-95e3-9524e30f1f74 deleted from vrouter uve ...
2026-10-05 04:07:49,907 - DEBUG - Deleted interface not in error interface list ...
2026-10-05 04:07:52,908 - DEBUG - Requesting: http://10.0.0.177:8081/analytics/uves/generator/an-jenkins-deploy-platform-ansible-os-6343-1:Compute:contrail-vrouter-agent:0?flat
2026-10-05 04:07:52,948 - DEBUG - Requesting: http://10.0.0.38:8081/analytics/uves/vrouter/an-jenkins-deploy-platform-ansible-os-6343-1?flat
2026-10-05 04:07:52,988 - DEBUG - VM 7c31ff59-2b65-4dbe-95e3-9524e30f1f74 is still present in vrouter an-jenkins-deploy-platform-ansible-os-6343-1 uve
2026-10-05 04:07:52,988 - DEBUG - Verifying if the vm interface deleted from vroter uve...
2026-10-05 04:07:52,988 - DEBUG - interface for vm 7c31ff59-2b65-4dbe-95e3-9524e30f1f74 deleted from vrouter uve ...
2026-10-05 04:07:52,988 - DEBUG - Deleted interface not in error interface list ...
2026-10-05 04:07:55,989 - DEBUG - Requesting: http://10.0.0.177:8081/analytics/uves/generator/an-jenkins-deploy-platform-ansible-os-6343-1:Compute:contrail-vrouter-agent:0?flat
2026-10-05 04:07:56,034 - DEBUG - Requesting: http://10.0.0.38:8081/analytics/uves/vrouter/an-jenkins-deploy-platform-ansible-os-6343-1?flat
2026-10-05 04:07:56,068 - DEBUG - VM 7c31ff59-2b65-4dbe-95e3-9524e30f1f74 is still present in vrouter an-jenkins-deploy-platform-ansible-os-6343-1 uve
2026-10-05 04:07:56,068 - DEBUG - Verifying if the vm interface deleted from vroter uve...
2026-10-05 04:07:56,068 - DEBUG - interface for vm 7c31ff59-2b65-4dbe-95e3-9524e30f1f74 deleted from vrouter uve ...
2026-10-05 04:07:56,068 - DEBUG - Deleted interface not in error interface list ...
2026-10-05 04:07:59,070 - DEBUG - Requesting: http://10.0.0.177:8081/analytics/uves/generator/an-jenkins-deploy-platform-ansible-os-6343-1:Compute:contrail-vrouter-agent:0?flat
2026-10-05 04:07:59,112 - DEBUG - Requesting: http://10.0.0.38:8081/analytics/uves/vrouter/an-jenkins-deploy-platform-ansible-os-6343-1?flat
2026-10-05 04:07:59,146 - DEBUG - VM 7c31ff59-2b65-4dbe-95e3-9524e30f1f74 is still present in vrouter an-jenkins-deploy-platform-ansible-os-6343-1 uve
2026-10-05 04:07:59,146 - DEBUG - Verifying if the vm interface deleted from vroter uve...
2026-10-05 04:07:59,146 - DEBUG - interface for vm 7c31ff59-2b65-4dbe-95e3-9524e30f1f74 deleted from vrouter uve ...
2026-10-05 04:07:59,146 - DEBUG - Deleted interface not in error interface list ...
2026-10-05 04:08:02,147 - DEBUG - Requesting: http://10.0.0.177:8081/analytics/uves/generator/an-jenkins-deploy-platform-ansible-os-6343-1:Compute:contrail-vrouter-agent:0?flat
2026-10-05 04:08:02,190 - DEBUG - Requesting: http://10.0.0.38:8081/analytics/uves/vrouter/an-jenkins-deploy-platform-ansible-os-6343-1?flat
2026-10-05 04:08:02,230 - DEBUG - VM 7c31ff59-2b65-4dbe-95e3-9524e30f1f74 is still present in vrouter an-jenkins-deploy-platform-ansible-os-6343-1 uve
2026-10-05 04:08:02,230 - DEBUG - Verifying if the vm interface deleted from vroter uve...
2026-10-05 04:08:02,230 - DEBUG - interface for vm 7c31ff59-2b65-4dbe-95e3-9524e30f1f74 deleted from vrouter uve ...
2026-10-05 04:08:02,230 - DEBUG - Deleted interface not in error interface list ...
2026-10-05 04:08:05,232 - DEBUG - Requesting: http://10.0.0.177:8081/analytics/uves/generator/an-jenkins-deploy-platform-ansible-os-6343-1:Compute:contrail-vrouter-agent:0?flat
2026-10-05 04:08:05,273 - DEBUG - Requesting: http://10.0.0.38:8081/analytics/uves/vrouter/an-jenkins-deploy-platform-ansible-os-6343-1?flat
2026-10-05 04:08:05,312 - DEBUG - VM 7c31ff59-2b65-4dbe-95e3-9524e30f1f74 is still present in vrouter an-jenkins-deploy-platform-ansible-os-6343-1 uve
2026-10-05 04:08:05,313 - DEBUG - Verifying if the vm interface deleted from vroter uve...
2026-10-05 04:08:05,313 - DEBUG - interface for vm 7c31ff59-2b65-4dbe-95e3-9524e30f1f74 deleted from vrouter uve ...
2026-10-05 04:08:05,313 - DEBUG - Deleted interface not in error interface list ...
2026-10-05 04:08:08,314 - DEBUG - Requesting: http://10.0.0.177:8081/analytics/uves/generator/an-jenkins-deploy-platform-ansible-os-6343-1:Compute:contrail-vrouter-agent:0?flat
2026-10-05 04:08:08,354 - DEBUG - Requesting: http://10.0.0.38:8081/analytics/uves/vrouter/an-jenkins-deploy-platform-ansible-os-6343-1?flat
2026-10-05 04:08:08,390 - DEBUG - VM 7c31ff59-2b65-4dbe-95e3-9524e30f1f74 is still present in vrouter an-jenkins-deploy-platform-ansible-os-6343-1 uve
2026-10-05 04:08:08,390 - DEBUG - Verifying if the vm interface deleted from vroter uve...
2026-10-05 04:08:08,390 - DEBUG - interface for vm 7c31ff59-2b65-4dbe-95e3-9524e30f1f74 deleted from vrouter uve ...
2026-10-05 04:08:08,390 - DEBUG - Deleted interface not in error interface list ...
2026-10-05 04:08:11,391 - DEBUG - Requesting: http://10.0.0.177:8081/analytics/uves/generator/an-jenkins-deploy-platform-ansible-os-6343-1:Compute:contrail-vrouter-agent:0?flat
2026-10-05 04:08:11,432 - DEBUG - Requesting: http://10.0.0.38:8081/analytics/uves/vrouter/an-jenkins-deploy-platform-ansible-os-6343-1?flat
2026-10-05 04:08:11,466 - DEBUG - VM 7c31ff59-2b65-4dbe-95e3-9524e30f1f74 is not present in vrouter an-jenkins-deploy-platform-ansible-os-6343-1 uve
2026-10-05 04:08:11,466 - DEBUG - Verifying if the vm interface deleted from vroter uve...
2026-10-05 04:08:11,466 - DEBUG - interface for vm 7c31ff59-2b65-4dbe-95e3-9524e30f1f74 deleted from vrouter uve ...
2026-10-05 04:08:11,466 - DEBUG - Deleted interface not in error interface list ...
2026-10-05 04:08:11,466 - DEBUG - Validated that VM 7c31ff59-2b65-4dbe-95e3-9524e30f1f74 is removed in Vrouter UVE
2026-10-05 04:08:11,466 - DEBUG - Verifying through opserver in 10.0.0.177
2026-10-05 04:08:11,466 - DEBUG - Requesting: http://10.0.0.177:8081/analytics/uves/virtual-network/default-domain:ctest-SecurityGroupBasicRegressionTests1-37697791:ctest-SecurityGroupBasicRegressionTests1-37697791-42364115?flat
2026-10-05 04:08:11,491 - DEBUG - 7c31ff59-2b65-4dbe-95e3-9524e30f1f74 BM not in default-domain:ctest-SecurityGroupBasicRegressionTests1-37697791:ctest-SecurityGroupBasicRegressionTests1-37697791-42364115 uve
2026-10-05 04:08:11,491 - DEBUG - Validated that VM 7c31ff59-2b65-4dbe-95e3-9524e30f1f74 is not present in the VN UVE
2026-10-05 04:08:11,491 - DEBUG - Verifying the 7c31ff59-2b65-4dbe-95e3-9524e30f1f74 virtual network link through opserver 10.0.0.177
2026-10-05 04:08:11,491 - DEBUG - Requesting: http://10.0.0.177:8081/analytics/uves/virtual-machines
2026-10-05 04:08:11,524 - INFO - 7c31ff59-2b65-4dbe-95e3-9524e30f1f74 vm uve deleted from opserver
2026-10-05 04:08:11,524 - DEBUG - Verifying the 7c31ff59-2b65-4dbe-95e3-9524e30f1f74 virtual network link through opserver 10.0.0.38
2026-10-05 04:08:11,524 - DEBUG - Requesting: http://10.0.0.38:8081/analytics/uves/virtual-machines
2026-10-05 04:08:11,540 - INFO - 7c31ff59-2b65-4dbe-95e3-9524e30f1f74 vm uve deleted from opserver
2026-10-05 04:08:11,540 - DEBUG - Verifying the 7c31ff59-2b65-4dbe-95e3-9524e30f1f74 virtual network link through opserver 10.0.0.190
2026-10-05 04:08:11,540 - DEBUG - Requesting: http://10.0.0.190:8081/analytics/uves/virtual-machines
2026-10-05 04:08:11,556 - INFO - 7c31ff59-2b65-4dbe-95e3-9524e30f1f74 vm uve deleted from opserver
2026-10-05 04:08:11,556 - INFO - Validated that VM 7c31ff59-2b65-4dbe-95e3-9524e30f1f74 is removed from Opserver
2026-10-05 04:08:11,556 - INFO - Deleting VN ctest-SecurityGroupBasicRegressionTests1-37697791-42364115
2026-10-05 04:08:11,804 - DEBUG - Response for deleting network ()
2026-10-05 04:08:11,804 - DEBUG - Requesting: http://10.0.0.177:8082/routing-instance/7924a10c-86d1-40bf-8a03-99d86ea107a6
2026-10-05 04:08:11,811 - DEBUG - Response Code: 404
2026-10-05 04:08:11,811 - DEBUG - Requesting: http://10.0.0.177:8082/domains
2026-10-05 04:08:11,820 - DEBUG - Requesting: http://10.0.0.177:8082/domain/6850e378-7089-4036-8f54-55c0ed1b9054
2026-10-05 04:08:11,841 - DEBUG - Requesting: http://10.0.0.177:8082/project/c6b61d79-85a5-455a-b313-7787be66bec9
2026-10-05 04:08:11,944 - INFO - Validated that VN ctest-SecurityGroupBasicRegressionTests1-37697791-42364115 is not found in API Server
2026-10-05 04:08:11,959 - DEBUG - VN ctest-SecurityGroupBasicRegressionTests1-37697791-42364115 is not present in Agent 10.0.0.50
2026-10-05 04:08:11,973 - DEBUG - VN ctest-SecurityGroupBasicRegressionTests1-37697791-42364115 is not present in Agent 10.0.0.191
2026-10-05 04:08:11,973 - INFO - Validated that VN ctest-SecurityGroupBasicRegressionTests1-37697791-42364115 is not in any agent
2026-10-05 04:08:12,020 - INFO - Validated that Routing instances and Config db in Control-nodes does not have VN ctest-SecurityGroupBasicRegressionTests1-37697791-42364115 info
2026-10-05 04:08:12,020 - INFO - Deleting Security group: ['default-domain', 'ctest-SecurityGroupBasicRegressionTests1-37697791', 'ctest-test_sec_group-54048221']
2026-10-05 04:08:12,110 - INFO - Security group: ['default-domain', 'ctest-SecurityGroupBasicRegressionTests1-37697791', 'ctest-test_sec_group-54048221'] deleted successfully.
2026-10-05 04:08:12,110 - DEBUG - Requesting: http://10.0.0.177:8082/domains
2026-10-05 04:08:12,125 - DEBUG - Requesting: http://10.0.0.177:8082/domain/6850e378-7089-4036-8f54-55c0ed1b9054
2026-10-05 04:08:12,149 - DEBUG - Requesting: http://10.0.0.177:8082/project/c6b61d79-85a5-455a-b313-7787be66bec9
2026-10-05 04:08:12,266 - INFO - Security group ctest-test_sec_group-54048221 removed from the API Server
2026-10-05 04:08:12,267 - DEBUG - Requesting: http://10.0.0.177:8082/domains
2026-10-05 04:08:12,276 - DEBUG - Requesting: http://10.0.0.177:8082/domain/6850e378-7089-4036-8f54-55c0ed1b9054
2026-10-05 04:08:12,292 - DEBUG - Requesting: http://10.0.0.177:8082/project/c6b61d79-85a5-455a-b313-7787be66bec9
2026-10-05 04:08:12,412 - DEBUG - Requesting: http://10.0.0.177:8082/access-control-lists
2026-10-05 04:08:12,423 - DEBUG - ACLs for Security group ctest-test_sec_group-54048221 removed from the API Server
2026-10-05 04:08:12,434 - INFO - security group ctest-test_sec_group-54048221 removed from Control-node 10.0.0.177
2026-10-05 04:08:12,441 - DEBUG - Security group ctest-test_sec_group-54048221 ACLs removed from the control node 10.0.0.177
2026-10-05 04:08:12,449 - INFO - security group ctest-test_sec_group-54048221 removed from Control-node 10.0.0.38
2026-10-05 04:08:12,456 - DEBUG - Security group ctest-test_sec_group-54048221 ACLs removed from the control node 10.0.0.38
2026-10-05 04:08:12,464 - INFO - security group ctest-test_sec_group-54048221 removed from Control-node 10.0.0.190
2026-10-05 04:08:12,473 - DEBUG - Security group ctest-test_sec_group-54048221 ACLs removed from the control node 10.0.0.190
2026-10-05 04:08:12,473 - INFO - Validated that SG ctest-test_sec_group-54048221 is not in control nodes
2026-10-05 04:08:13,781 - ERROR - AssertionError
Python 3.9.25: /usr/bin/python3
Mon Oct 5 04:07:41 2026
A problem occurred in a Python script. Here is the sequence of
function calls leading up to the error, in the order they occurred.
/contrail-test/tcutils/wrappers.py in wrapper(self=, *args=(), **kwargs={})
78 log.info('Initial checks done. Running the testcase now')
79 log.info('')
80 result = function(self, *args, **kwargs)
81 if self.inputs.upgrade:
82 pid = os.getpid()
result = None
function =
self =
args = ()
kwargs = {}
/contrail-test/scripts/securitygroup/test_regression_basic.py in test_sec_group_basic(self=)
89 assert vm1_fixture.verify_on_setup()
90 assert vm1_fixture.wait_till_vm_is_up()
91 assert vm2_fixture.verify_on_setup()
92 assert vm2_fixture.wait_till_vm_is_up()
93
vm2_fixture =
vm2_fixture.verify_on_setup = >
AssertionError:
__cause__ = None
__class__ =
__context__ = None
__delattr__ =
__dict__ = {}
__dir__ =
__doc__ = 'Assertion failed.'
__eq__ =
__format__ =
__ge__ =
__getattribute__ =
__gt__ =
__hash__ =
__init__ =
__init_subclass__ =
__le__ =
__lt__ =
__ne__ =
__new__ =
__reduce__ =
__reduce_ex__ =
__repr__ =
__setattr__ =
__setstate__ =
__sizeof__ =
__str__ =
__subclasshook__ =
__suppress_context__ = False
__traceback__ =
args = ()
with_traceback =
The above is a description of an error in a Python program. Here is
the original traceback:
Traceback (most recent call last):
File "/contrail-test/tcutils/wrappers.py", line 80, in wrapper
result = function(self, *args, **kwargs)
File "/contrail-test/scripts/securitygroup/test_regression_basic.py", line 91, in test_sec_group_basic
assert vm2_fixture.verify_on_setup()
AssertionError
2026-10-05 04:08:13,795 - DEBUG - No XMPP flaps were noticed during the test
2026-10-05 04:08:13,795 - INFO -
2026-10-05 04:08:13,795 - INFO - END TEST : test_sec_group_basic : FAILED[0:04:25]
2026-10-05 04:08:13,795 - INFO - --------------------------------------------------------------------------------
2026-10-05 04:08:14,746 - INFO - Deleted project: ctest-SecurityGroupBasicRegressionTests1-37697791, ID : c6b61d79-85a5-455a-b313-7787be66bec9